{"text_format":"1","workbook":"xlsx","n_sheets":9,"sheets":["Master","Introduction","Instructions","User Interface","Storage & Containment","Conveyance","Treatment","Use & Disposal","Summary"],"not_rendered":{"charts":0,"images":11,"macros":1,"external_links":0,"defined_names":13,"comments":0,"pivot_tables":5},"unopened":[],"bounds":{"document_bytes":16777216,"sheet_cells":100000,"rows_first":2000,"rows_last":500,"rows_between":2000,"halvings":0,"cell_chars":16384,"cell_head_chars":4096},"cells_cut":0,"cells_raw":0,"read":"whole","date_system":"1900"}

{"sheet":"Master","index":0,"n_rows":122,"n_cols":32,"rows_kept":122,"cut":false,"hidden":true,"merged":[]}
["Phase","Technology","Method of use","Urine diverting","Type of system","Primary materials","Availability ","Proceed to ","Method of use (SC)","Urine diversion ","Type of system","Number of users","Containment ","Suitable for high water table or flood prone area","Minimum available space","Removal system","Treatment","Outputs for reuse","Availability","Proceed to","Removal method","Availability","Proceed to","Treatment","Inputs ","Outputs for disposal","Outputs for reuse","Availability4","Proceed to ","Reuse or disposal","Outputs for reuse","Potential application "]
["User interface ","Container Based Solutions","Container","Either","Either","Various","For purchase","Storage & containment"]
["User interface ","Ecological Urinal ","Squat","Yes","Dry","Plastic","For purchase","Storage & containment"]
["User interface ","Ecosan Pit Toilets - VIP 450, VIP 200","Sit","No","Dry","Plastic","For purchase","Storage & containment"]
["User interface ","Otji Dry Toilet Solutions","Sit","Yes","Dry","Ceramic","For purchase","Storage & containment"]
["User interface ","Pedestal Seats (category)","Sit","No","Either","Plastic","For purchase","Storage & containment"]
["User interface ","Piet Urine Diversion Toilet","Sit","Yes","Wet","Ceramic","For purchase","Storage & containment"]
["User interface ","SaTo Hygenic Toilet Pans","Sit/Squat","No","Wet","Plastic","For purchase","Storage & containment"]
["User interface ","Separett Privy Kit","Sit","Yes","Dry","Plastic","For purchase","Storage & containment"]
["User interface ","Squat Pans (category)","Squat","No","Either","Various","For purchase","Storage & containment"]
["User interface ","Urine Diverting Toilets","Sit/Squat","Yes","Either","Plastic","For purchase","Storage & containment"]
["Storage and containment","Airhead Composting Toilet","Container",{"$f":"J12","v":"Yes"},{"$f":"K12","v":"Dry"},null,null,null,"Sit","Yes","Dry","Household","Above ground","Yes","0-9m²","Container","Offsite","Compost","For purchase","Conveyance",null,null,null,null,null,null,{"$f":"R12","v":"Compost"}]
["Storage and containment","Aqua Privys (Septic Tank)","Sit/Squat",{"$f":"J13","v":"No"},{"$f":"K13","v":"Wet"},null,null,null,"Either","No","Wet","Either","Below ground","No","9-49m²","Manual/Pump","Offsite","None","For purchase","Conveyance",null,null,null,null,null,null,"None"]
["Storage and containment","Aquatron Toilet","Container","Yes","Wet",null,null,null,"Sit","Yes","Wet","Household","Container","No","0-9m²","Container","Offsite","Compost","For purchase","Conveyance",null,null,null,null,null,null,"Compost"]
["Storage and containment","Arborloo","Sit/Squat","Yes","Dry",null,null,null,"Either","Yes","Dry","Household","Below ground","No","0-9m²","NA","Onsite","None","Open source","Use and/or disposal",null,null,null,null,null,null,"None"]
["Storage and containment","Banos Mejorados Secos Design",{"$f":"I16","v":"Sit"},"Yes","Dry",null,null,null,"Sit","Yes","Dry","Household","Above ground","Yes","0-9m²","Manual/Pump","Offsite","Compost","For purchase","Conveyance ",null,null,null,null,null,null,"Compost"]
["Storage and containment","Biofil Digester","Sit/Squat","No","Wet",null,null,null,"Either","No","Wet","Household","Above ground","Yes","9-49m²","NA","Onsite","Compost","For purchase","Use and/or disposal",null,null,null,null,null,null,"Compost"]
["Storage and containment","BioSanGas Toilet and Biogas System","Sit","No","Wet",null,null,null,"Sit","No","Wet","Community","Above ground","Yes","9-49m²","NA","Onsite","Biogas","For purchase","Use and/or disposal",null,null,null,null,null,null,"Biogas"]
["Storage and containment","Blue Diversion Toilet ","Container","Yes","Dry",null,null,null,"Squat","Yes","Dry","Either","Container","Yes","0-9m²","Container","Offsite","Compost","In development","Conveyance",null,null,null,null,null,null,"Compost"]
["Storage and containment","Bristol Emergency Chemical Toilet","Container","No","Dry",null,null,null,"Sit","No","Dry","Household","Container","Yes","0-9m²","Container","Offsite","None","For purchase","Conveyance",null,null,null,null,null,null,"None"]
["Storage and containment","CalTech Toilet ","Sit","No","Wet",null,null,null,"Sit","No","Wet","Household","Container","Yes","0-9m²","NA","Onsite","Briquettes","In development","Use and/or disposal",null,null,null,null,null,null,"Briquettes"]
["Storage and containment","Crainfield Nano Membrane Toilet","Sit","Yes","Dry",null,null,null,"Sit","Yes","Dry","Household","Above ground","Yes","0-9m²","NA","Onsite","None","In development","Use and/or disposal",null,null,null,null,null,null,"None"]
["Storage and containment","TfP Space-Saver Composting Toilet (Crapper)","Container","Yes","Dry",null,null,null,"Sit","Yes","Dry","Household","Above ground","Yes","0-9m²","Container","Offsite","Compost","For purchase","Conveyance ",null,null,null,null,null,null,"Compost"]
["Storage and containment","Duraplast Septic Tank","Sit/Squat","No","Wet",null,null,null,"Either","No","Wet","Household","Below ground","Yes","0-9m²","Manual/Pump","Offsite","None","For purchase","Conveyance",null,null,null,null,null,null,"None"]
["Storage and containment","Earth Auger",{"$f":"I25","v":"Sit"},{"$f":"J25","v":"Yes"},"Dry",null,null,null,"Sit","Yes","Dry","Household","Above ground","Yes","0-9m²","NA","Onsite","Compost","In development","Use and/or disposal",null,null,null,null,null,null,"Compost"]
["Storage and containment","Ecodomeo","Sit/Squat","No","Dry",null,null,null,"Either","No","Dry","Household","Above ground","Yes","9-49m²","NA","Onsite","Compost","For purchase","Use and/or disposal",null,null,null,null,null,null,"Compost"]
["Storage and containment","Ecological Urinal ","Container","Yes","Dry",null,null,null,"Squat","Yes","Dry","Household","Container","Yes","0-9m²","Container","NA","None","For purchase","Conveyance",null,null,null,null,null,null,"None"]
["Storage and containment","Ecosan Pit Toilets - VIP 450, VIP 200","Sit","No","Dry",null,null,null,"Sit","No","Dry","Household","Container","No","0-9m²","Manual/Pump","Offsite","Compost","For purchase","Conveyance ",null,null,null,null,null,null,"Compost"]
["Storage and containment","Ecosan Waterless Toilet","Sit","No","Dry",null,null,null,"Sit","No","Dry","Household","Above ground","Yes","9-49m²","NA","Onsite","Compost","For purchase","Use and/or disposal",null,null,null,null,null,null,"Compost"]
["Storage and containment","EkoLakay Toilet","Container","Yes","Dry",null,null,null,"Sit","Yes","Dry","Household","Container","Yes","0-9m²","Container","Offsite","Compost","For purchase","Conveyance",null,null,null,null,null,null,"Compost"]
["Storage and containment","Enbiolet Toilet - Community","Sit/Squat","Yes","Wet",null,null,null,"Either","Yes","Wet","Community","Above ground","Yes",">49m²","NA","Onsite","None","For purchase","Use and/or disposal",null,null,null,null,null,null,"None"]
["Storage and containment","Enbiolet Toilet - Single","Sit/Squat","Yes","Wet",null,null,null,"Either","Yes","Wet","Household","Above ground","Yes","0-9m²","NA","Onsite","None","For purchase","Use and/or disposal",null,null,null,null,null,null,"None"]
["Storage and containment","Enviro-Loo - Communal","Sit","Yes","Dry",null,null,null,"Sit","Yes","Dry","Community","Below ground","Yes","0-9m²","NA","Onsite","Compost","For purchase","Use and/or disposal",null,null,null,null,null,null,"Compost"]
["Storage and containment","Enviro-Loo - Domestic","Sit","Yes","Dry",null,null,null,"Sit","Yes","Dry","Household","Below ground","Yes","0-9m²","NA","Onsite","Compost","For purchase","Use and/or disposal",null,null,null,null,null,null,"Compost"]
["Storage and containment","Enviro-Loo - Industrial","Sit","Yes","Dry",null,null,null,"Sit","Yes","Dry","Community","Below ground","Yes","9-49m²","NA","Onsite","Compost","For purchase","Use and/or disposal",null,null,null,null,null,null,"Compost"]
["Storage and containment","Enviro-Loo - Urinal ","Sit","Yes","Dry",null,null,null,"Sit","Yes","Dry","Community","Below ground","Yes","0-9m²","NA","NA","None","For purchase","Conveyance",null,null,null,null,null,null,"None"]
["Storage and containment","Envirosan - Double Chamber Urine Diversion","Sit","Yes","Dry",null,null,null,"Sit","Yes","Dry","Household","Below ground","Yes","9-49m²","Manual","Offsite","Compost","For purchase","Conveyance ",null,null,null,null,null,null,"Compost"]
["Storage and containment","Envirosan - Urine Diversion with Removable Bin","Sit","Yes","Dry",null,null,null,"Sit","Yes","Dry","Household","Above ground","Yes","0-9m²","NA","Onsite","Compost","For purchase","Use and/or disposal",null,null,null,null,null,null,"Compost"]
["Storage and containment","Envirosan - VIP with Toilet","Sit","Yes","Dry",null,null,null,"Sit","Yes","Dry","Household","Below ground","No","0-9m²","Manual/Pump","Offsite","Compost","For purchase","Conveyance",null,null,null,null,null,null,"Compost"]
["Storage and containment","Envirosan - VIP with Urine Diversion","Sit","Yes","Dry",null,null,null,"Sit","Yes","Dry","Household","Below ground","Yes","0-9m²","Manual/Pump","Offsite","Compost","For purchase","Conveyance ",null,null,null,null,null,null,"Compost"]
["Storage and containment","Eram Delight","Sit","Yes","Wet",null,null,null,"Sit","Yes","Wet","Community","Above ground","Yes",">49m²","NA","Onsite","None","For purchase","Use and/or disposal",null,null,null,null,null,null,"None"]
["Storage and containment","Easy Latrine","Squat","No","Wet",null,null,null,"Either","No","Wet","Household","Below ground","No","9-49m²","NA","Onsite","Compost","For purchase","Use and/or disposal",null,null,null,null,null,null,"Compost"]
["Storage and containment","Flexi Biogas Systems Model BG5","Sit/Squat","No","Wet",null,null,null,"Either","No","Wet","Household","Above ground","Yes","9-49m²","Manual/Pump","Onsite","Biogas","For purchase","Use and/or disposal",null,null,null,null,null,null,"Biogas"]
["Storage and containment","Flexi Biogas Systems Model BG6","Sit/Squat","No","Wet",null,null,null,"Either","No","Wet","Household","Above ground","Yes","9-49m²","Manual/Pump","Onsite","Biogas","For purchase","Use and/or disposal",null,null,null,null,null,null,{"$f":"R44","v":"Biogas"}]
["Storage and containment","Flexi Biogas Systems Model DBG","Sit/Squat","No","Wet",null,null,null,"Either","No","Wet","Community","Above ground","Yes","9-49m²","Manual/Pump","Offsite","Biogas","For purchase","Use and/or disposal",null,null,null,null,null,null,"Biogas"]
["Storage and containment","Flexigester SIB Kit","Sit/Squat","No","Wet",null,null,null,"Either","No","Wet","Community","Below ground","Yes",">49m²","Manual/Pump","Offsite","Biogas","For purchase","Conveyance",null,null,null,null,null,null,"Biogas"]
["Storage and containment","Flexigester V10 Kit","Sit/Squat","No","Wet",null,null,null,"Either","No","Wet","Community","Below ground","Yes",">49m²","Manual/Pump","Offsite","Biogas","For purchase","Use and/or disposal",null,null,null,null,null,null,"Biogas"]
["Storage and containment","Fossa Alterna (double pit latrine)","Sit/Squat","No","Dry",null,null,null,"Either","No","Dry","Household","Below ground","No","9-49m²","NA","Onsite","Compost","Open source","Use and/or disposal",null,null,null,null,null,null,"Compost"]
["Storage and containment","GesiShamba","Sit/Squat","No","Wet",null,null,null,"Either","No","Wet","Household","Above ground","Yes","9-49m²","NA","Onsite","Biogas","For purchase","Use and/or disposal",null,null,null,null,null,null,"Biogas"]
["Storage and containment","Ghana Sustainable Aid Project Microflush Toilets","Sit/Squat","Yes","Dry",null,null,null,"Either","Yes","Dry","Household","Below ground","No","9-49m²","NA","Onsite","Compost","For purchase","Use and/or disposal",null,null,null,null,null,null,"Compost"]
["Storage and containment","Green, Portable Toilet","Container","No","Dry",null,null,null,"Sit","No","Dry","Community","Container","Yes","9-49m²","Container","Offsite","Compost","In development","Conveyance",null,null,null,null,null,null,"Compost"]
["Storage and containment","Loolaboo","Container","No","Wet",null,null,null,"Either","No","Wet","Household","Container","Yes","9-49m²","Container","Offsite","Compost","For purchase","Conveyance",null,null,null,null,null,null,"Compost"]
["Storage and containment","Loowatt","Container","No","Dry",null,null,null,"Sit","No","Dry","Either","Container","Yes","0-9m²","Container","Offsite","Biogas","For purchase","Conveyance",null,null,null,null,null,null,"Biogas"]
["Storage and containment","Loughborough Universities Toilet",{"$f":"I54","v":"Sit"},"No","Dry",null,null,null,"Sit","No","Dry","Household","Container","Yes","0-9m²","NA","Onsite","Briquettes","In development","Use and/or disposal",null,null,null,null,null,null,"Briquettes"]
["Storage and containment","Lovable Loo","Container","No","Dry",null,null,null,"Sit","No","Dry","Household","Container","Yes","0-9m²","Container","Offsite","Compost","For purchase","Conveyance",null,null,null,null,null,null,"Compost"]
["Storage and containment","Microbial Fuel Cell Latrine","Sit","No","Dry",null,null,null,"Sit","No","Dry","Household","Below ground","No","0-9m²","NA","Onsite","Compost","In development","Use and/or disposal",null,null,null,null,null,null,"Compost"]
["Storage and containment","MoSan Toilet","Container",{"$f":"J57","v":"Yes"},"Dry",null,null,null,"Sit","Yes","Dry","Household","Container","Yes","0-9m²","Container","Offsite","Compost","For purchase","Conveyance",null,null,null,null,null,null,"Compost"]
["Storage and containment","Otji Toilet","Sit","Yes","Dry",null,null,null,"Sit","Yes","Dry","Household","Below ground","No","0-9m²","Manual","Offsite","Compost","For purchase","Conveyance ",null,null,null,null,null,null,"Compost"]
["Storage and containment","Oxford Emergency Chemical Toilet","Container","No","Dry",null,null,null,"Sit","No","Dry","Household","Container","Yes","0-9m²","Container","Offsite","None","For purchase","Conveyance ",null,null,null,null,null,null,"None"]
["Storage and containment","Peepoo Bag","Container","No","Dry",null,null,null,"Squat","No","Dry","Either","Container","No","0-9m²","Container","Onsite","None","For purchase","Use and/or disposal",null,null,null,null,null,null,"None"]
["Storage and containment","Perfect Privy","Container","Yes","Dry",null,null,null,"Sit","Yes","Dry","Household","Container","Yes","0-9m²","Container","Offsite","Compost","For purchase","Conveyance ",null,null,null,null,null,null,"Compost"]
["Storage and containment","Single Pit Latrine","Sit/Squat","No","Dry",null,null,null,"Either","No","Dry","Household","Below ground","No","0-9m²","Manual/Pump","Offsite","None","Open source","Conveyance ",null,null,null,null,null,null,"None"]
["Storage and containment","RTI Toilet","Sit","Yes","Dry",null,null,null,"Sit","Yes","Dry","Household","Above ground","Yes","9-49m²","NA","Onsite","None","In development","Use and/or disposal",null,null,null,null,null,null,"None"]
["Storage and containment","Sanergy Model - Fresh Life Toilet","Container","Yes","Dry",null,null,null,"Sit","Yes","Dry","Either","Container","Yes","0-9m²","Container","Offsite","Compost","For purchase","Conveyance",null,null,null,null,null,null,"Compost"]
["Storage and containment","Sanivation Solutions Bucket Toilet","Container","Yes","Dry",null,null,null,"Sit","Yes","Dry","Household","Container","Yes","0-9m²","Container","Offsite","Briquettes","For purchase","Conveyance",null,null,null,null,null,null,"Briquettes"]
["Storage and containment","Separett Toilets","Container","Yes","Dry",null,null,null,"Sit","Yes","Dry","Household","Container","Yes","0-9m²","Container","Offsite","Compost","For purchase","Conveyance",null,null,null,null,null,null,"Compost"]
["Storage and containment","Septic Tank","Sit/Squat","No","Wet",null,null,null,"Either","No","Wet","Either","Above ground","Yes","0-9m²","Manual/Pump","Offsite","None","For purchase","Conveyance",null,null,null,null,null,null,"None"]
["Storage and containment","SimSan BucketMate Toilet","Container","Yes","Dry",null,null,null,"Sit","Yes","Dry","Household","Container","Yes","0-9m²","Container","Offsite","Compost","For purchase","Conveyance",null,null,null,null,null,null,"Compost"]
["Storage and containment","Sistema Biobolsa - Wastewater Treatment","Sit/Squat","Yes","Wet",null,null,null,"Either","Yes","Wet","Household","Above ground","Yes","0-9m²","NA","Onsite","Biogas","For purchase","Use and/or disposal",null,null,null,null,null,null,"Biogas"]
["Storage and containment","Sulabh Household Toilet","Sit/Squat","Yes","Wet",null,null,null,"Either","Yes","Wet","Household","Below ground","No","9-49m²","NA","Onsite","Compost","For purchase","Use and/or disposal",null,null,null,null,null,null,"Compost"]
["Storage and containment","Sun-Mar Toilet and Two-Pit System","Sit/Squat","Yes","Dry",null,null,null,"Either","Yes","Dry","Household","Container","Yes","0-9m²","NA","Onsite","Compost","For purchase","Use and/or disposal",null,null,null,null,null,null,"Compost"]
["Storage and containment","Tiger Worm Toilet","Sit","No","Wet",null,null,null,"Sit","No","Wet","Household","Above ground","Yes","0-9m²","NA","Onsite","Compost","For purchase","Use and/or disposal",null,null,null,null,null,null,"Compost"]
["Storage and containment","Clean Team Toilet","Container","Yes","Dry",null,null,null,"Sit","Yes","Dry","Household","Container","Yes","0-9m²","Container","Offsite","None","For purchase","Conveyance",null,null,null,null,null,null,"None"]
["Storage and containment","University of Toronto Smoldering Toilet","Sit","Yes","Dry",null,null,null,"Sit","Yes","Dry","Household","Above ground","Yes","0-9m²","NA","Onsite","None","In development","Use and/or disposal",null,null,null,null,null,null,"None"]
["Storage and containment","Ventilated Improved Pit Latrine","Sit/Squat","No",{"$f":"K75","v":"Dry"},null,null,null,"Either","No","Dry","Household","Below ground","No","0-9m²","Manual/Pump","Offsite","None","Open source","Conveyance",null,null,null,null,null,null,"None"]
["Storage and containment","Visa Portable Chemical Toilet","Container","No",{"$f":"K76","v":"Wet"},null,null,null,"Sit","No","Wet","Household","Container","Yes","0-9m²","Container","Offsite","Compost","For purchase","Conveyance ",null,null,null,null,null,null,"Compost"]
["Storage and containment","WooWoo Waterless Toilets (KL1, KL2, KL3, STK)","Sit","Yes",{"$f":"K77","v":"Dry"},null,null,null,"Sit","Yes","Dry","Community","Above ground","Yes","0-9m²","NA","Onsite","Compost","For purchase","Use and/or disposal",null,null,null,null,null,null,"Compost"]
["Storage and containment","X-Runner","Container","Yes",{"$f":"K78","v":"Dry"},null,null,null,"Sit","Yes","Dry","Household","Container","Yes","0-9m²","Container","Offsite","Compost","For purchase","Conveyance ",null,null,null,null,null,null,"Compost"]
["Conveyance","Container Based System",null,null,null,null,null,null,null,null,null,null,null,null,null,null,"Offsite",null,null,null,"Container","For purchase","Treatment"]
["Conveyance","Diaphragm Pump",null,null,null,null,null,null,null,null,null,null,null,null,null,null,"Offsite",null,null,null,"Pump (both)","For purchase","Treatment"]
["Conveyance","eVac (electric vacuum)",null,null,null,null,null,null,null,null,null,null,null,null,null,null,"Offsite",null,null,null,"Pump (motorized)","For purchase","Treatment"]
["Conveyance","Excrevator ",null,null,null,null,null,null,null,null,null,null,null,null,null,null,"Offsite",null,null,null,"Pump (motorized)","In development","Treatment"]
["Conveyance","Gulper / Extendable Gulper",null,null,null,null,null,null,null,null,null,null,null,null,null,null,"Offsite",null,null,null,"Pump (manual)","For purchase","Treatment"]
["Conveyance","Hand tools and personal protective equipment ",null,null,null,null,null,null,null,null,null,null,null,null,null,null,"Offsite",null,null,null,"Manual","For purchase","Treatment"]
["Conveyance","Manual Pump (Omni-Ingestor)",null,null,null,null,null,null,null,null,null,null,null,null,null,null,"Offsite",null,null,null,"Pump (manual)","In development","Treatment"]
["Conveyance","Pit Screw Auger",null,null,null,null,null,null,null,null,null,null,null,null,null,null,"Offsite",null,null,null,"Pump (motorized)","For purchase","Treatment"]
["Conveyance","Poo Pump",null,null,null,null,null,null,null,null,null,null,null,null,null,null,"Offsite",null,null,null,"Pump (manual)","For purchase","Treatment"]
["Conveyance","Sewer system (simplified, solids-free, conventional)",null,null,null,null,null,null,null,null,null,null,null,null,null,null,"Offsite",null,null,null,"Pipe","Open source ","Treatment"]
["Conveyance","Sludge Digger",null,null,null,null,null,null,null,null,null,null,null,null,null,null,"Offsite",null,null,null,"Manual","In development","Treatment"]
["Conveyance","Vacuum truck",null,null,null,null,null,null,null,null,null,null,null,null,null,null,"Offsite",null,null,null,"Pump (motorized)","For purchase","Treatment"]
["Treatment","Activated sludge",null,null,null,null,null,null,null,null,null,null,null,null,null,null,{"$f":"X91","v":"Offsite"},{"$f":"AA91","v":"None"},null,null,null,null,null,"Offsite","Effluent, Blackwater, Brownwater, Greywater","Effluent, Sludge","None","Open source","Use and/or disposal"]
["Treatment","Aerated Pond",null,null,null,null,null,null,null,null,null,null,null,null,null,null,"Offsite","None",null,null,null,null,null,"Offsite","Effluent, Blackwater, Brownwater, Greywater","Effluent, Sludge","None","Open source","Use and/or disposal"]
["Treatment","Anaerobic Baffled Reactor",null,null,null,null,null,null,null,null,null,null,null,null,null,null,"Offsite","None",null,null,null,null,null,"Offsite","Blackwater, Greywater","Effluent, Sludge","None","Open source","Use and/or disposal"]
["Treatment","Anaerobic Filter",null,null,null,null,null,null,null,null,null,null,null,null,null,null,"Offsite","None",null,null,null,null,null,"Offsite","Blackwater, Greywater","Effluent, Sludge","None","Open source","Use and/or disposal"]
["Treatment","Anaerobic Membrance Bioreactor (AnMBR)",null,null,null,null,null,null,null,null,null,null,null,null,null,null,"Offsite","Biogas",null,null,null,null,null,"Offsite","Blackwater, Greywater, Food waste","Sludge","Biogas","In development","Use and/or disposal"]
["Treatment","Biogas Reactor",null,null,null,null,null,null,null,null,null,null,null,null,null,null,"Offsite","Biogas",null,null,null,null,null,"Offsite","Sludge, Organics, Blackwater","Sludge","Biogas","For purchase","Use and/or disposal"]
["Treatment","Bolah Bondeh Project: Organic Compost",null,null,null,null,null,null,null,null,null,null,null,null,null,null,"Offsite","Compost",null,null,null,null,null,"Offsite","Sludge","None","Compost","In development","Use and/or disposal"]
["Treatment","Co-composting",null,null,null,null,null,null,null,null,null,null,null,null,null,null,"Offsite","Compost",null,null,null,null,null,"Offsite","Sludge, Organics","None","Compost","Open source","Use and/or disposal"]
["Treatment","Flexi Biogas Systems Model BG6",null,null,null,null,null,null,null,null,null,null,null,null,null,null,"Offsite","Biogas",null,null,null,null,null,"Offsite","Sludge, Organics, Blackwater","Sludge","Biogas","For purchase","Use and/or disposal"]
["Treatment","Constructed Wetland: Free-Water Surface",null,null,null,null,null,null,null,null,null,null,null,null,null,null,"Offsite","None",null,null,null,null,null,"Offsite","Effluent, Stormwater ","Effluent, Biomass","None","Open source","Use and/or disposal"]
["Treatment","Sedimentation / Thickening Ponds ",null,null,null,null,null,null,null,null,null,null,null,null,null,null,"Offsite","None",null,null,null,null,null,"Offsite","Sludge","Sludge, Effluent","None","Open source","Use and/or disposal"]
["Treatment","Constructed Wetland: Horizontal Subsurface Flow ",null,null,null,null,null,null,null,null,null,null,null,null,null,null,"Offsite","None",null,null,null,null,null,"Offsite","Effluent, Blackwater, Brownwater, Greywater","Effluent, Biomass","None","Open source","Use and/or disposal"]
["Treatment","Howard-Higgins EcoSan and Waste Management System",null,null,null,null,null,null,null,null,null,null,null,null,null,null,"Offsite","Compost",null,null,null,null,null,"Offsite","Sludge, Organics","None","Compost","For purchase","Use and/or disposal"]
["Treatment","Imhoff Tank",null,null,null,null,null,null,null,null,null,null,null,null,null,null,"Offsite","Biogas",null,null,null,null,null,"Offsite","Blackwater, Greywater","Effluent, Sludge","Biogas","For purchase","Use and/or disposal"]
["Treatment","LaDePa (Latrine Dehydration and Pasturization)",null,null,null,null,null,null,null,null,null,null,null,null,null,null,"Offsite","None",null,null,null,null,null,"Offsite","Sludge","Disinfected dried solids","None","For purchase","Use and/or disposal"]
["Treatment","Drying Beds: Planted ",null,null,null,null,null,null,null,null,null,null,null,null,null,null,"Offsite","Biomass",null,null,null,null,null,"Offsite","Sludge","Sludge, Effluent","Biomass","Open source","Use and/or disposal"]
["Treatment","Sanivation Solar Charcoal Oven",null,null,null,null,null,null,null,null,null,null,null,null,null,null,"Offsite","Briquettes",null,null,null,null,null,"Offsite","Solid waste, Biochar","None","Briquettes","For purchase","Use and/or disposal"]
["Treatment","Solar Sludge Oven ",null,null,null,null,null,null,null,null,null,null,null,null,null,null,"Offsite","None",null,null,null,null,null,"Offsite","Sludge","Disinfected dried solids","None","In development","Use and/or disposal"]
["Treatment","Settler",null,null,null,null,null,null,null,null,null,null,null,null,null,null,"Offsite","None",null,null,null,null,null,"Offsite","Blackwater, Brownwater, Greywater","Effluent, Sludge","None","Open source","Use and/or disposal"]
["Treatment","Trickling Filter",null,null,null,null,null,null,null,null,null,null,null,null,null,null,"Offsite","None",null,null,null,null,null,"Offsite","Sludge","Effluent, Sludge","None","For purchase","Use and/or disposal"]
["Treatment","Drying Beds: Unplanted",null,null,null,null,null,null,null,null,null,null,null,null,null,null,"Offsite","None",null,null,null,null,null,"Offsite","Sludge","Sludge, Effluent","None","Open source","Use and/or disposal"]
["Treatment","Upflow Anaerobic Sludge Blanket Reactor ",null,null,null,null,null,null,null,null,null,null,null,null,null,null,"Offsite","Biogas",null,null,null,null,null,"Offsite","Blackwater, Greywater","Effluent, Sludge","Biogas","For purchase","Use and/or disposal"]
["Treatment","Community Vermiculture ",null,null,null,null,null,null,null,null,null,null,null,null,null,null,"Offsite","Compost",null,null,null,null,null,"Offsite","Sludge","None","Compost","In development","Use and/or disposal"]
["Treatment","Constructed Wetland: Vertical Flow ",null,null,null,null,null,null,null,null,null,null,null,null,null,null,"Offsite","None",null,null,null,null,null,"Offsite","Effluent, Blackwater, Brownwater, Greywater","Effluent, Biomass","None","Open source","Use and/or disposal"]
["Treatment","Waste Stabilization Ponds",null,null,null,null,null,null,null,null,null,null,null,null,null,null,"Offsite","None",null,null,null,null,null,"Offsite","Blackwater, Greywater","Effluent, Sludge","None","Open source","Use and/or disposal"]
["Use and/or Disposal","Biogas",null,null,null,null,null,null,null,null,null,null,null,null,null,null,null,{"$f":"AE116","v":"Biogas"},null,null,null,null,null,null,null,null,null,null,null,"Reuse","Biogas","Cooking, lighting, charging a generator. "]
["Use and/or Disposal","Biomass",null,null,null,null,null,null,null,null,null,null,null,null,null,null,null,{"$f":"AE117","v":"Biomass"},null,null,null,null,null,null,null,null,null,null,null,"Reuse","Biomass","Includes fish, insects, vegetables, fruits, forage or other beneficial crops."]
["Use and/or Disposal","Briquettes",null,null,null,null,null,null,null,null,null,null,null,null,null,null,null,{"$f":"AE118","v":"Briquettes"},null,null,null,null,null,null,null,null,null,null,null,"Reuse","Briquettes","Cooking, heat."]
["Use and/or Disposal","Compost",null,null,null,null,null,null,null,null,null,null,null,null,null,null,null,"Compost",null,null,null,null,null,null,null,null,null,null,null,"Reuse","Compost","Fertilizer for soil fertility, moisture retention, and increase in agricultural/horticultural productivity. "]
["Use and/or Disposal","Disinfected dried solids ",null,null,null,null,null,null,null,null,null,null,null,null,null,null,null,"None",null,null,null,null,null,null,null,null,null,null,null,"Disposal","None","Fill and cover, land application, surface disposal."]
["Use and/or Disposal","Sludge",null,null,null,null,null,null,null,null,null,null,null,null,null,null,null,"None",null,null,null,null,null,null,null,null,null,null,null,"Disposal","None","Fill and cover, land application, surface disposal (depends on level of treatment)."]
["Use and/or Disposal","Effluent (treated, disinfected)",null,null,null,null,null,null,null,null,null,null,null,null,null,null,null,"None",null,null,null,null,null,null,null,null,null,null,null,"Disposal","None","Irrigation, soak pit, leach field."]

{"sheet":"Introduction","index":1,"n_rows":57,"n_cols":11,"rows_kept":57,"cut":false,"hidden":false,"merged":[[24,2,44,8],[24,10,39,16],[45,2,54,16]]}
[]
[]
[]
[]
[]
[]
[]
[]
[]
[]
[]
[]
[]
[]
[]
[]
[]
[]
[]
[]
[]
[]
[]
[]
[null,null,"In 2016, PATH conducted an in-depth global landscape on sanitation technologies. Over 200 sanitation technologies–including commercialized products–were compiled and categorized. Results from the landscape indicated that while information on specific global sanitation technologies is available, there is a lack of resources that provide comparative information across the sanitation service chain. The landscape highlighted the lack of decision support tools for technology selection in specific settings. As new and improved sanitation technologies become available, it is important for sanitation engineers and program implementers to be able to prioritize and select technologies based on how well the technologies address their specific context and/or needs. \n\nBased on these results and with input from WASH experts, PATH developed the Sanitation Technology Filtering Tool—an interactive, decision-support tool designed to assist sanitation engineers and program implementers in identifying appropriate sanitation technologies based on a particular context and need. \n\n\n© 2017 PATH. All Rights Reserved. CC BY SA.\n\n\n",null,null,null,null,null,null,null,"PATH used the widely-accepted sanitation service chain framework developed by the Swiss Federal Institute of Aquatic Science and Technology (Eawag), to organize the technologies into each of the five phases of the sanitation service chain: (1) user interface, (2) storage and containment, (3) conveyance, (4) treatment, and (5) use and/or disposal. For each phase, key filters are included to support in the user’s down selection process. \n\nThe Sanitation Technology Filtering Tool provides a systemic approach to comparatively review and assess technology options for specific settings. We hope the Sanitaiton Technology Filtering Tool will help the global WASH community identify and prioritize technologies with the greatest potential to address their sanitation challenges. \n"]
[]
[]
[]
[]
[]
[]
[]
[]
[]
[]
[]
[]
[]
[]
[]
[]
[]
[]
[]
[]
[null,null,"This tool was developed by the Sanitation Service Delivery (SSD) Program in West Africa, under a United States Agency for International Development (USAID) five-year cooperative agreement with Population Services International (PSI), PATH, and Water & Sanitation for the Urban Poor (WSUP). This tool is made possible by the support of the American people through USAID. The contents are the sole responsibility of PATH and do not necessarily reflect the views of USAID or the United States government.\n\n\n\n\n\n"]
[]
[]
[]
[]
[]
[]
[]
[]
[]
[null,null,"Contact: Chelsea Schiller, cschiller@path.org. "]
[null,null,"Last modifited: July 2017"]

{"sheet":"Instructions","index":2,"n_rows":0,"n_cols":0,"rows_kept":0,"cut":false,"hidden":false,"merged":[]}

{"sheet":"User Interface","index":3,"n_rows":89,"n_cols":7,"rows_kept":89,"cut":false,"hidden":false,"merged":[]}
["USER INTERFACE",null,"When listed, always include \"Either\" in your selection so that all appropriate technologies are listed. "]
[]
[]
[]
[]
[]
[]
[]
[]
[]
[]
[]
[]
[]
[]
[]
[]
[]
["Phase","User interface "]
["Method of use","(All)"]
["Urine diverting","(All)"]
["Primary materials","(All)"]
["Technology","Type of system","Method of use",{"$f":"Master!D1","v":"Urine diverting"},{"$f":"Master!F1","v":"Primary materials"},{"$f":"Master!G1","v":"Availability "},"Proceed to "]
["Container Based Solutions",{"$f":"IF(A24 = \"\", \"\",VLOOKUP('User Interface'!A24,Master!B:AF,COLUMN(Master!$E$1)-1, FALSE))","v":"Either"},{"$f":"IF(A24 = \"\", \"\",VLOOKUP('User Interface'!A24,Master!B:AF,COLUMN(Master!$C$1)-1, FALSE))","v":"Container"},{"$f":"IF(A24 = \"\", \"\",VLOOKUP('User Interface'!A24,Master!B:AF,COLUMN(Master!$D$1)-1, FALSE))","v":"Either"},{"$f":"IF(A24 = \"\", \"\",VLOOKUP('User Interface'!A24,Master!B:AF,COLUMN(Master!$F$1)-1, FALSE))","v":"Various"},{"$f":"IF(A24 = \"\", \"\",VLOOKUP('User Interface'!A24,Master!B:AF,COLUMN(Master!$G$1)-1, FALSE))","v":"For purchase"},{"$f":"IF(A24 = \"\", \"\",VLOOKUP('User Interface'!A24,Master!B:AF,COLUMN(Master!$H$1)-1, FALSE))","v":"Storage & containment"}]
["Ecological Urinal ",{"$f":"IF(A25 = \"\", \"\",VLOOKUP('User Interface'!A25,Master!B:AF,COLUMN(Master!$E$1)-1, FALSE))","v":"Dry"},{"$f":"IF(A25 = \"\", \"\",VLOOKUP('User Interface'!A25,Master!B:AF,COLUMN(Master!$C$1)-1, FALSE))","v":"Squat"},{"$f":"IF(A25 = \"\", \"\",VLOOKUP('User Interface'!A25,Master!B:AF,COLUMN(Master!$D$1)-1, FALSE))","v":"Yes"},{"$f":"IF(A25 = \"\", \"\",VLOOKUP('User Interface'!A25,Master!B:AF,COLUMN(Master!$F$1)-1, FALSE))","v":"Plastic"},{"$f":"IF(A25 = \"\", \"\",VLOOKUP('User Interface'!A25,Master!B:AF,COLUMN(Master!$G$1)-1, FALSE))","v":"For purchase"},{"$f":"IF(A25 = \"\", \"\",VLOOKUP('User Interface'!A25,Master!B:AF,COLUMN(Master!$H$1)-1, FALSE))","v":"Storage & containment"}]
["Ecosan Pit Toilets - VIP 450, VIP 200",{"$f":"IF(A26 = \"\", \"\",VLOOKUP('User Interface'!A26,Master!B:AF,COLUMN(Master!$E$1)-1, FALSE))","v":"Dry"},{"$f":"IF(A26 = \"\", \"\",VLOOKUP('User Interface'!A26,Master!B:AF,COLUMN(Master!$C$1)-1, FALSE))","v":"Sit"},{"$f":"IF(A26 = \"\", \"\",VLOOKUP('User Interface'!A26,Master!B:AF,COLUMN(Master!$D$1)-1, FALSE))","v":"No"},{"$f":"IF(A26 = \"\", \"\",VLOOKUP('User Interface'!A26,Master!B:AF,COLUMN(Master!$F$1)-1, FALSE))","v":"Plastic"},{"$f":"IF(A26 = \"\", \"\",VLOOKUP('User Interface'!A26,Master!B:AF,COLUMN(Master!$G$1)-1, FALSE))","v":"For purchase"},{"$f":"IF(A26 = \"\", \"\",VLOOKUP('User Interface'!A26,Master!B:AF,COLUMN(Master!$H$1)-1, FALSE))","v":"Storage & containment"}]
["Otji Dry Toilet Solutions",{"$f":"IF(A27 = \"\", \"\",VLOOKUP('User Interface'!A27,Master!B:AF,COLUMN(Master!$E$1)-1, FALSE))","v":"Dry"},{"$f":"IF(A27 = \"\", \"\",VLOOKUP('User Interface'!A27,Master!B:AF,COLUMN(Master!$C$1)-1, FALSE))","v":"Sit"},{"$f":"IF(A27 = \"\", \"\",VLOOKUP('User Interface'!A27,Master!B:AF,COLUMN(Master!$D$1)-1, FALSE))","v":"Yes"},{"$f":"IF(A27 = \"\", \"\",VLOOKUP('User Interface'!A27,Master!B:AF,COLUMN(Master!$F$1)-1, FALSE))","v":"Ceramic"},{"$f":"IF(A27 = \"\", \"\",VLOOKUP('User Interface'!A27,Master!B:AF,COLUMN(Master!$G$1)-1, FALSE))","v":"For purchase"},{"$f":"IF(A27 = \"\", \"\",VLOOKUP('User Interface'!A27,Master!B:AF,COLUMN(Master!$H$1)-1, FALSE))","v":"Storage & containment"}]
["Pedestal Seats (category)",{"$f":"IF(A28 = \"\", \"\",VLOOKUP('User Interface'!A28,Master!B:AF,COLUMN(Master!$E$1)-1, FALSE))","v":"Either"},{"$f":"IF(A28 = \"\", \"\",VLOOKUP('User Interface'!A28,Master!B:AF,COLUMN(Master!$C$1)-1, FALSE))","v":"Sit"},{"$f":"IF(A28 = \"\", \"\",VLOOKUP('User Interface'!A28,Master!B:AF,COLUMN(Master!$D$1)-1, FALSE))","v":"No"},{"$f":"IF(A28 = \"\", \"\",VLOOKUP('User Interface'!A28,Master!B:AF,COLUMN(Master!$F$1)-1, FALSE))","v":"Plastic"},{"$f":"IF(A28 = \"\", \"\",VLOOKUP('User Interface'!A28,Master!B:AF,COLUMN(Master!$G$1)-1, FALSE))","v":"For purchase"},{"$f":"IF(A28 = \"\", \"\",VLOOKUP('User Interface'!A28,Master!B:AF,COLUMN(Master!$H$1)-1, FALSE))","v":"Storage & containment"}]
["Piet Urine Diversion Toilet",{"$f":"IF(A29 = \"\", \"\",VLOOKUP('User Interface'!A29,Master!B:AF,COLUMN(Master!$E$1)-1, FALSE))","v":"Wet"},{"$f":"IF(A29 = \"\", \"\",VLOOKUP('User Interface'!A29,Master!B:AF,COLUMN(Master!$C$1)-1, FALSE))","v":"Sit"},{"$f":"IF(A29 = \"\", \"\",VLOOKUP('User Interface'!A29,Master!B:AF,COLUMN(Master!$D$1)-1, FALSE))","v":"Yes"},{"$f":"IF(A29 = \"\", \"\",VLOOKUP('User Interface'!A29,Master!B:AF,COLUMN(Master!$F$1)-1, FALSE))","v":"Ceramic"},{"$f":"IF(A29 = \"\", \"\",VLOOKUP('User Interface'!A29,Master!B:AF,COLUMN(Master!$G$1)-1, FALSE))","v":"For purchase"},{"$f":"IF(A29 = \"\", \"\",VLOOKUP('User Interface'!A29,Master!B:AF,COLUMN(Master!$H$1)-1, FALSE))","v":"Storage & containment"}]
["SaTo Hygenic Toilet Pans",{"$f":"IF(A30 = \"\", \"\",VLOOKUP('User Interface'!A30,Master!B:AF,COLUMN(Master!$E$1)-1, FALSE))","v":"Wet"},{"$f":"IF(A30 = \"\", \"\",VLOOKUP('User Interface'!A30,Master!B:AF,COLUMN(Master!$C$1)-1, FALSE))","v":"Sit/Squat"},{"$f":"IF(A30 = \"\", \"\",VLOOKUP('User Interface'!A30,Master!B:AF,COLUMN(Master!$D$1)-1, FALSE))","v":"No"},{"$f":"IF(A30 = \"\", \"\",VLOOKUP('User Interface'!A30,Master!B:AF,COLUMN(Master!$F$1)-1, FALSE))","v":"Plastic"},{"$f":"IF(A30 = \"\", \"\",VLOOKUP('User Interface'!A30,Master!B:AF,COLUMN(Master!$G$1)-1, FALSE))","v":"For purchase"},{"$f":"IF(A30 = \"\", \"\",VLOOKUP('User Interface'!A30,Master!B:AF,COLUMN(Master!$H$1)-1, FALSE))","v":"Storage & containment"}]
["Separett Privy Kit",{"$f":"IF(A31 = \"\", \"\",VLOOKUP('User Interface'!A31,Master!B:AF,COLUMN(Master!$E$1)-1, FALSE))","v":"Dry"},{"$f":"IF(A31 = \"\", \"\",VLOOKUP('User Interface'!A31,Master!B:AF,COLUMN(Master!$C$1)-1, FALSE))","v":"Sit"},{"$f":"IF(A31 = \"\", \"\",VLOOKUP('User Interface'!A31,Master!B:AF,COLUMN(Master!$D$1)-1, FALSE))","v":"Yes"},{"$f":"IF(A31 = \"\", \"\",VLOOKUP('User Interface'!A31,Master!B:AF,COLUMN(Master!$F$1)-1, FALSE))","v":"Plastic"},{"$f":"IF(A31 = \"\", \"\",VLOOKUP('User Interface'!A31,Master!B:AF,COLUMN(Master!$G$1)-1, FALSE))","v":"For purchase"},{"$f":"IF(A31 = \"\", \"\",VLOOKUP('User Interface'!A31,Master!B:AF,COLUMN(Master!$H$1)-1, FALSE))","v":"Storage & containment"}]
["Squat Pans (category)",{"$f":"IF(A32 = \"\", \"\",VLOOKUP('User Interface'!A32,Master!B:AF,COLUMN(Master!$E$1)-1, FALSE))","v":"Either"},{"$f":"IF(A32 = \"\", \"\",VLOOKUP('User Interface'!A32,Master!B:AF,COLUMN(Master!$C$1)-1, FALSE))","v":"Squat"},{"$f":"IF(A32 = \"\", \"\",VLOOKUP('User Interface'!A32,Master!B:AF,COLUMN(Master!$D$1)-1, FALSE))","v":"No"},{"$f":"IF(A32 = \"\", \"\",VLOOKUP('User Interface'!A32,Master!B:AF,COLUMN(Master!$F$1)-1, FALSE))","v":"Various"},{"$f":"IF(A32 = \"\", \"\",VLOOKUP('User Interface'!A32,Master!B:AF,COLUMN(Master!$G$1)-1, FALSE))","v":"For purchase"},{"$f":"IF(A32 = \"\", \"\",VLOOKUP('User Interface'!A32,Master!B:AF,COLUMN(Master!$H$1)-1, FALSE))","v":"Storage & containment"}]
["Urine Diverting Toilets",{"$f":"IF(A33 = \"\", \"\",VLOOKUP('User Interface'!A33,Master!B:AF,COLUMN(Master!$E$1)-1, FALSE))","v":"Either"},{"$f":"IF(A33 = \"\", \"\",VLOOKUP('User Interface'!A33,Master!B:AF,COLUMN(Master!$C$1)-1, FALSE))","v":"Sit/Squat"},{"$f":"IF(A33 = \"\", \"\",VLOOKUP('User Interface'!A33,Master!B:AF,COLUMN(Master!$D$1)-1, FALSE))","v":"Yes"},{"$f":"IF(A33 = \"\", \"\",VLOOKUP('User Interface'!A33,Master!B:AF,COLUMN(Master!$F$1)-1, FALSE))","v":"Plastic"},{"$f":"IF(A33 = \"\", \"\",VLOOKUP('User Interface'!A33,Master!B:AF,COLUMN(Master!$G$1)-1, FALSE))","v":"For purchase"},{"$f":"IF(A33 = \"\", \"\",VLOOKUP('User Interface'!A33,Master!B:AF,COLUMN(Master!$H$1)-1, FALSE))","v":"Storage & containment"}]
[null,{"$f":"IF(A34 = \"\", \"\",VLOOKUP('User Interface'!A34,Master!B:AF,COLUMN(Master!$E$1)-1, FALSE))","v":""},{"$f":"IF(A34 = \"\", \"\",VLOOKUP('User Interface'!A34,Master!B:AF,COLUMN(Master!$C$1)-1, FALSE))","v":""},{"$f":"IF(A34 = \"\", \"\",VLOOKUP('User Interface'!A34,Master!B:AF,COLUMN(Master!$D$1)-1, FALSE))","v":""},{"$f":"IF(A34 = \"\", \"\",VLOOKUP('User Interface'!A34,Master!B:AF,COLUMN(Master!$F$1)-1, FALSE))","v":""},{"$f":"IF(A34 = \"\", \"\",VLOOKUP('User Interface'!A34,Master!B:AF,COLUMN(Master!$G$1)-1, FALSE))","v":""},{"$f":"IF(A34 = \"\", \"\",VLOOKUP('User Interface'!A34,Master!B:AF,COLUMN(Master!$H$1)-1, FALSE))","v":""}]
[null,{"$f":"IF(A35 = \"\", \"\",VLOOKUP('User Interface'!A35,Master!B:AF,COLUMN(Master!$E$1)-1, FALSE))","v":""},{"$f":"IF(A35 = \"\", \"\",VLOOKUP('User Interface'!A35,Master!B:AF,COLUMN(Master!$C$1)-1, FALSE))","v":""},{"$f":"IF(A35 = \"\", \"\",VLOOKUP('User Interface'!A35,Master!B:AF,COLUMN(Master!$D$1)-1, FALSE))","v":""},{"$f":"IF(A35 = \"\", \"\",VLOOKUP('User Interface'!A35,Master!B:AF,COLUMN(Master!$F$1)-1, FALSE))","v":""},{"$f":"IF(A35 = \"\", \"\",VLOOKUP('User Interface'!A35,Master!B:AF,COLUMN(Master!$G$1)-1, FALSE))","v":""},{"$f":"IF(A35 = \"\", \"\",VLOOKUP('User Interface'!A35,Master!B:AF,COLUMN(Master!$H$1)-1, FALSE))","v":""}]
[null,{"$f":"IF(A36 = \"\", \"\",VLOOKUP('User Interface'!A36,Master!B:AF,COLUMN(Master!$E$1)-1, FALSE))","v":""},{"$f":"IF(A36 = \"\", \"\",VLOOKUP('User Interface'!A36,Master!B:AF,COLUMN(Master!$C$1)-1, FALSE))","v":""},{"$f":"IF(A36 = \"\", \"\",VLOOKUP('User Interface'!A36,Master!B:AF,COLUMN(Master!$D$1)-1, FALSE))","v":""},{"$f":"IF(A36 = \"\", \"\",VLOOKUP('User Interface'!A36,Master!B:AF,COLUMN(Master!$F$1)-1, FALSE))","v":""},{"$f":"IF(A36 = \"\", \"\",VLOOKUP('User Interface'!A36,Master!B:AF,COLUMN(Master!$G$1)-1, FALSE))","v":""},{"$f":"IF(A36 = \"\", \"\",VLOOKUP('User Interface'!A36,Master!B:AF,COLUMN(Master!$H$1)-1, FALSE))","v":""}]
[null,{"$f":"IF(A37 = \"\", \"\",VLOOKUP('User Interface'!A37,Master!B:AF,COLUMN(Master!$E$1)-1, FALSE))","v":""},{"$f":"IF(A37 = \"\", \"\",VLOOKUP('User Interface'!A37,Master!B:AF,COLUMN(Master!$C$1)-1, FALSE))","v":""},{"$f":"IF(A37 = \"\", \"\",VLOOKUP('User Interface'!A37,Master!B:AF,COLUMN(Master!$D$1)-1, FALSE))","v":""},{"$f":"IF(A37 = \"\", \"\",VLOOKUP('User Interface'!A37,Master!B:AF,COLUMN(Master!$F$1)-1, FALSE))","v":""},{"$f":"IF(A37 = \"\", \"\",VLOOKUP('User Interface'!A37,Master!B:AF,COLUMN(Master!$G$1)-1, FALSE))","v":""},{"$f":"IF(A37 = \"\", \"\",VLOOKUP('User Interface'!A37,Master!B:AF,COLUMN(Master!$H$1)-1, FALSE))","v":""}]
[null,{"$f":"IF(A38 = \"\", \"\",VLOOKUP('User Interface'!A38,Master!B:AF,COLUMN(Master!$E$1)-1, FALSE))","v":""},{"$f":"IF(A38 = \"\", \"\",VLOOKUP('User Interface'!A38,Master!B:AF,COLUMN(Master!$C$1)-1, FALSE))","v":""},{"$f":"IF(A38 = \"\", \"\",VLOOKUP('User Interface'!A38,Master!B:AF,COLUMN(Master!$D$1)-1, FALSE))","v":""},{"$f":"IF(A38 = \"\", \"\",VLOOKUP('User Interface'!A38,Master!B:AF,COLUMN(Master!$F$1)-1, FALSE))","v":""},{"$f":"IF(A38 = \"\", \"\",VLOOKUP('User Interface'!A38,Master!B:AF,COLUMN(Master!$G$1)-1, FALSE))","v":""},{"$f":"IF(A38 = \"\", \"\",VLOOKUP('User Interface'!A38,Master!B:AF,COLUMN(Master!$H$1)-1, FALSE))","v":""}]
[null,{"$f":"IF(A39 = \"\", \"\",VLOOKUP('User Interface'!A39,Master!B:AF,COLUMN(Master!$E$1)-1, FALSE))","v":""},{"$f":"IF(A39 = \"\", \"\",VLOOKUP('User Interface'!A39,Master!B:AF,COLUMN(Master!$C$1)-1, FALSE))","v":""},{"$f":"IF(A39 = \"\", \"\",VLOOKUP('User Interface'!A39,Master!B:AF,COLUMN(Master!$D$1)-1, FALSE))","v":""},{"$f":"IF(A39 = \"\", \"\",VLOOKUP('User Interface'!A39,Master!B:AF,COLUMN(Master!$F$1)-1, FALSE))","v":""},{"$f":"IF(A39 = \"\", \"\",VLOOKUP('User Interface'!A39,Master!B:AF,COLUMN(Master!$G$1)-1, FALSE))","v":""},{"$f":"IF(A39 = \"\", \"\",VLOOKUP('User Interface'!A39,Master!B:AF,COLUMN(Master!$H$1)-1, FALSE))","v":""}]
[null,{"$f":"IF(A40 = \"\", \"\",VLOOKUP('User Interface'!A40,Master!B:AF,COLUMN(Master!$E$1)-1, FALSE))","v":""},{"$f":"IF(A40 = \"\", \"\",VLOOKUP('User Interface'!A40,Master!B:AF,COLUMN(Master!$C$1)-1, FALSE))","v":""},{"$f":"IF(A40 = \"\", \"\",VLOOKUP('User Interface'!A40,Master!B:AF,COLUMN(Master!$D$1)-1, FALSE))","v":""},{"$f":"IF(A40 = \"\", \"\",VLOOKUP('User Interface'!A40,Master!B:AF,COLUMN(Master!$F$1)-1, FALSE))","v":""},{"$f":"IF(A40 = \"\", \"\",VLOOKUP('User Interface'!A40,Master!B:AF,COLUMN(Master!$G$1)-1, FALSE))","v":""},{"$f":"IF(A40 = \"\", \"\",VLOOKUP('User Interface'!A40,Master!B:AF,COLUMN(Master!$H$1)-1, FALSE))","v":""}]
[null,{"$f":"IF(A41 = \"\", \"\",VLOOKUP('User Interface'!A41,Master!B:AF,COLUMN(Master!$E$1)-1, FALSE))","v":""},{"$f":"IF(A41 = \"\", \"\",VLOOKUP('User Interface'!A41,Master!B:AF,COLUMN(Master!$C$1)-1, FALSE))","v":""},{"$f":"IF(A41 = \"\", \"\",VLOOKUP('User Interface'!A41,Master!B:AF,COLUMN(Master!$D$1)-1, FALSE))","v":""},{"$f":"IF(A41 = \"\", \"\",VLOOKUP('User Interface'!A41,Master!B:AF,COLUMN(Master!$F$1)-1, FALSE))","v":""},{"$f":"IF(A41 = \"\", \"\",VLOOKUP('User Interface'!A41,Master!B:AF,COLUMN(Master!$G$1)-1, FALSE))","v":""},{"$f":"IF(A41 = \"\", \"\",VLOOKUP('User Interface'!A41,Master!B:AF,COLUMN(Master!$H$1)-1, FALSE))","v":""}]
[null,{"$f":"IF(A42 = \"\", \"\",VLOOKUP('User Interface'!A42,Master!B:AF,COLUMN(Master!$E$1)-1, FALSE))","v":""},{"$f":"IF(A42 = \"\", \"\",VLOOKUP('User Interface'!A42,Master!B:AF,COLUMN(Master!$C$1)-1, FALSE))","v":""},{"$f":"IF(A42 = \"\", \"\",VLOOKUP('User Interface'!A42,Master!B:AF,COLUMN(Master!$D$1)-1, FALSE))","v":""},{"$f":"IF(A42 = \"\", \"\",VLOOKUP('User Interface'!A42,Master!B:AF,COLUMN(Master!$F$1)-1, FALSE))","v":""},{"$f":"IF(A42 = \"\", \"\",VLOOKUP('User Interface'!A42,Master!B:AF,COLUMN(Master!$G$1)-1, FALSE))","v":""},{"$f":"IF(A42 = \"\", \"\",VLOOKUP('User Interface'!A42,Master!B:AF,COLUMN(Master!$H$1)-1, FALSE))","v":""}]
[null,{"$f":"IF(A43 = \"\", \"\",VLOOKUP('User Interface'!A43,Master!B:AF,COLUMN(Master!$E$1)-1, FALSE))","v":""},{"$f":"IF(A43 = \"\", \"\",VLOOKUP('User Interface'!A43,Master!B:AF,COLUMN(Master!$C$1)-1, FALSE))","v":""},{"$f":"IF(A43 = \"\", \"\",VLOOKUP('User Interface'!A43,Master!B:AF,COLUMN(Master!$D$1)-1, FALSE))","v":""},{"$f":"IF(A43 = \"\", \"\",VLOOKUP('User Interface'!A43,Master!B:AF,COLUMN(Master!$F$1)-1, FALSE))","v":""},{"$f":"IF(A43 = \"\", \"\",VLOOKUP('User Interface'!A43,Master!B:AF,COLUMN(Master!$G$1)-1, FALSE))","v":""},{"$f":"IF(A43 = \"\", \"\",VLOOKUP('User Interface'!A43,Master!B:AF,COLUMN(Master!$H$1)-1, FALSE))","v":""}]
[null,{"$f":"IF(A44 = \"\", \"\",VLOOKUP('User Interface'!A44,Master!B:AF,COLUMN(Master!$E$1)-1, FALSE))","v":""},{"$f":"IF(A44 = \"\", \"\",VLOOKUP('User Interface'!A44,Master!B:AF,COLUMN(Master!$C$1)-1, FALSE))","v":""},{"$f":"IF(A44 = \"\", \"\",VLOOKUP('User Interface'!A44,Master!B:AF,COLUMN(Master!$D$1)-1, FALSE))","v":""},{"$f":"IF(A44 = \"\", \"\",VLOOKUP('User Interface'!A44,Master!B:AF,COLUMN(Master!$F$1)-1, FALSE))","v":""},{"$f":"IF(A44 = \"\", \"\",VLOOKUP('User Interface'!A44,Master!B:AF,COLUMN(Master!$G$1)-1, FALSE))","v":""},{"$f":"IF(A44 = \"\", \"\",VLOOKUP('User Interface'!A44,Master!B:AF,COLUMN(Master!$H$1)-1, FALSE))","v":""}]
[null,{"$f":"IF(A45 = \"\", \"\",VLOOKUP('User Interface'!A45,Master!B:AF,COLUMN(Master!$E$1)-1, FALSE))","v":""},{"$f":"IF(A45 = \"\", \"\",VLOOKUP('User Interface'!A45,Master!B:AF,COLUMN(Master!$C$1)-1, FALSE))","v":""},{"$f":"IF(A45 = \"\", \"\",VLOOKUP('User Interface'!A45,Master!B:AF,COLUMN(Master!$D$1)-1, FALSE))","v":""},{"$f":"IF(A45 = \"\", \"\",VLOOKUP('User Interface'!A45,Master!B:AF,COLUMN(Master!$F$1)-1, FALSE))","v":""},{"$f":"IF(A45 = \"\", \"\",VLOOKUP('User Interface'!A45,Master!B:AF,COLUMN(Master!$G$1)-1, FALSE))","v":""},{"$f":"IF(A45 = \"\", \"\",VLOOKUP('User Interface'!A45,Master!B:AF,COLUMN(Master!$H$1)-1, FALSE))","v":""}]
[null,{"$f":"IF(A46 = \"\", \"\",VLOOKUP('User Interface'!A46,Master!B:AF,COLUMN(Master!$E$1)-1, FALSE))","v":""},{"$f":"IF(A46 = \"\", \"\",VLOOKUP('User Interface'!A46,Master!B:AF,COLUMN(Master!$C$1)-1, FALSE))","v":""},{"$f":"IF(A46 = \"\", \"\",VLOOKUP('User Interface'!A46,Master!B:AF,COLUMN(Master!$D$1)-1, FALSE))","v":""},{"$f":"IF(A46 = \"\", \"\",VLOOKUP('User Interface'!A46,Master!B:AF,COLUMN(Master!$F$1)-1, FALSE))","v":""},{"$f":"IF(A46 = \"\", \"\",VLOOKUP('User Interface'!A46,Master!B:AF,COLUMN(Master!$G$1)-1, FALSE))","v":""},{"$f":"IF(A46 = \"\", \"\",VLOOKUP('User Interface'!A46,Master!B:AF,COLUMN(Master!$H$1)-1, FALSE))","v":""}]
[null,{"$f":"IF(A47 = \"\", \"\",VLOOKUP('User Interface'!A47,Master!B:AF,COLUMN(Master!$E$1)-1, FALSE))","v":""},{"$f":"IF(A47 = \"\", \"\",VLOOKUP('User Interface'!A47,Master!B:AF,COLUMN(Master!$C$1)-1, FALSE))","v":""},{"$f":"IF(A47 = \"\", \"\",VLOOKUP('User Interface'!A47,Master!B:AF,COLUMN(Master!$D$1)-1, FALSE))","v":""},{"$f":"IF(A47 = \"\", \"\",VLOOKUP('User Interface'!A47,Master!B:AF,COLUMN(Master!$F$1)-1, FALSE))","v":""},{"$f":"IF(A47 = \"\", \"\",VLOOKUP('User Interface'!A47,Master!B:AF,COLUMN(Master!$G$1)-1, FALSE))","v":""},{"$f":"IF(A47 = \"\", \"\",VLOOKUP('User Interface'!A47,Master!B:AF,COLUMN(Master!$H$1)-1, FALSE))","v":""}]
[null,{"$f":"IF(A48 = \"\", \"\",VLOOKUP('User Interface'!A48,Master!B:AF,COLUMN(Master!$E$1)-1, FALSE))","v":""},{"$f":"IF(A48 = \"\", \"\",VLOOKUP('User Interface'!A48,Master!B:AF,COLUMN(Master!$C$1)-1, FALSE))","v":""},{"$f":"IF(A48 = \"\", \"\",VLOOKUP('User Interface'!A48,Master!B:AF,COLUMN(Master!$D$1)-1, FALSE))","v":""},{"$f":"IF(A48 = \"\", \"\",VLOOKUP('User Interface'!A48,Master!B:AF,COLUMN(Master!$F$1)-1, FALSE))","v":""},{"$f":"IF(A48 = \"\", \"\",VLOOKUP('User Interface'!A48,Master!B:AF,COLUMN(Master!$G$1)-1, FALSE))","v":""},{"$f":"IF(A48 = \"\", \"\",VLOOKUP('User Interface'!A48,Master!B:AF,COLUMN(Master!$H$1)-1, FALSE))","v":""}]
[null,{"$f":"IF(A49 = \"\", \"\",VLOOKUP('User Interface'!A49,Master!B:AF,COLUMN(Master!$E$1)-1, FALSE))","v":""},{"$f":"IF(A49 = \"\", \"\",VLOOKUP('User Interface'!A49,Master!B:AF,COLUMN(Master!$C$1)-1, FALSE))","v":""},{"$f":"IF(A49 = \"\", \"\",VLOOKUP('User Interface'!A49,Master!B:AF,COLUMN(Master!$D$1)-1, FALSE))","v":""},{"$f":"IF(A49 = \"\", \"\",VLOOKUP('User Interface'!A49,Master!B:AF,COLUMN(Master!$F$1)-1, FALSE))","v":""},{"$f":"IF(A49 = \"\", \"\",VLOOKUP('User Interface'!A49,Master!B:AF,COLUMN(Master!$G$1)-1, FALSE))","v":""},{"$f":"IF(A49 = \"\", \"\",VLOOKUP('User Interface'!A49,Master!B:AF,COLUMN(Master!$H$1)-1, FALSE))","v":""}]
[null,{"$f":"IF(A50 = \"\", \"\",VLOOKUP('User Interface'!A50,Master!B:AF,COLUMN(Master!$E$1)-1, FALSE))","v":""},{"$f":"IF(A50 = \"\", \"\",VLOOKUP('User Interface'!A50,Master!B:AF,COLUMN(Master!$C$1)-1, FALSE))","v":""},{"$f":"IF(A50 = \"\", \"\",VLOOKUP('User Interface'!A50,Master!B:AF,COLUMN(Master!$D$1)-1, FALSE))","v":""},{"$f":"IF(A50 = \"\", \"\",VLOOKUP('User Interface'!A50,Master!B:AF,COLUMN(Master!$F$1)-1, FALSE))","v":""},{"$f":"IF(A50 = \"\", \"\",VLOOKUP('User Interface'!A50,Master!B:AF,COLUMN(Master!$G$1)-1, FALSE))","v":""},{"$f":"IF(A50 = \"\", \"\",VLOOKUP('User Interface'!A50,Master!B:AF,COLUMN(Master!$H$1)-1, FALSE))","v":""}]
[null,{"$f":"IF(A51 = \"\", \"\",VLOOKUP('User Interface'!A51,Master!B:AF,COLUMN(Master!$E$1)-1, FALSE))","v":""},{"$f":"IF(A51 = \"\", \"\",VLOOKUP('User Interface'!A51,Master!B:AF,COLUMN(Master!$C$1)-1, FALSE))","v":""},{"$f":"IF(A51 = \"\", \"\",VLOOKUP('User Interface'!A51,Master!B:AF,COLUMN(Master!$D$1)-1, FALSE))","v":""},{"$f":"IF(A51 = \"\", \"\",VLOOKUP('User Interface'!A51,Master!B:AF,COLUMN(Master!$F$1)-1, FALSE))","v":""},{"$f":"IF(A51 = \"\", \"\",VLOOKUP('User Interface'!A51,Master!B:AF,COLUMN(Master!$G$1)-1, FALSE))","v":""},{"$f":"IF(A51 = \"\", \"\",VLOOKUP('User Interface'!A51,Master!B:AF,COLUMN(Master!$H$1)-1, FALSE))","v":""}]
[null,{"$f":"IF(A52 = \"\", \"\",VLOOKUP('User Interface'!A52,Master!B:AF,COLUMN(Master!$E$1)-1, FALSE))","v":""},{"$f":"IF(A52 = \"\", \"\",VLOOKUP('User Interface'!A52,Master!B:AF,COLUMN(Master!$C$1)-1, FALSE))","v":""},{"$f":"IF(A52 = \"\", \"\",VLOOKUP('User Interface'!A52,Master!B:AF,COLUMN(Master!$D$1)-1, FALSE))","v":""},{"$f":"IF(A52 = \"\", \"\",VLOOKUP('User Interface'!A52,Master!B:AF,COLUMN(Master!$F$1)-1, FALSE))","v":""},{"$f":"IF(A52 = \"\", \"\",VLOOKUP('User Interface'!A52,Master!B:AF,COLUMN(Master!$G$1)-1, FALSE))","v":""},{"$f":"IF(A52 = \"\", \"\",VLOOKUP('User Interface'!A52,Master!B:AF,COLUMN(Master!$H$1)-1, FALSE))","v":""}]
[null,{"$f":"IF(A53 = \"\", \"\",VLOOKUP('User Interface'!A53,Master!B:AF,COLUMN(Master!$E$1)-1, FALSE))","v":""},{"$f":"IF(A53 = \"\", \"\",VLOOKUP('User Interface'!A53,Master!B:AF,COLUMN(Master!$C$1)-1, FALSE))","v":""},{"$f":"IF(A53 = \"\", \"\",VLOOKUP('User Interface'!A53,Master!B:AF,COLUMN(Master!$D$1)-1, FALSE))","v":""},{"$f":"IF(A53 = \"\", \"\",VLOOKUP('User Interface'!A53,Master!B:AF,COLUMN(Master!$F$1)-1, FALSE))","v":""},{"$f":"IF(A53 = \"\", \"\",VLOOKUP('User Interface'!A53,Master!B:AF,COLUMN(Master!$G$1)-1, FALSE))","v":""},{"$f":"IF(A53 = \"\", \"\",VLOOKUP('User Interface'!A53,Master!B:AF,COLUMN(Master!$H$1)-1, FALSE))","v":""}]
[null,{"$f":"IF(A54 = \"\", \"\",VLOOKUP('User Interface'!A54,Master!B:AF,COLUMN(Master!$E$1)-1, FALSE))","v":""},{"$f":"IF(A54 = \"\", \"\",VLOOKUP('User Interface'!A54,Master!B:AF,COLUMN(Master!$C$1)-1, FALSE))","v":""},{"$f":"IF(A54 = \"\", \"\",VLOOKUP('User Interface'!A54,Master!B:AF,COLUMN(Master!$D$1)-1, FALSE))","v":""},{"$f":"IF(A54 = \"\", \"\",VLOOKUP('User Interface'!A54,Master!B:AF,COLUMN(Master!$F$1)-1, FALSE))","v":""},{"$f":"IF(A54 = \"\", \"\",VLOOKUP('User Interface'!A54,Master!B:AF,COLUMN(Master!$G$1)-1, FALSE))","v":""},{"$f":"IF(A54 = \"\", \"\",VLOOKUP('User Interface'!A54,Master!B:AF,COLUMN(Master!$H$1)-1, FALSE))","v":""}]
[null,{"$f":"IF(A55 = \"\", \"\",VLOOKUP('User Interface'!A55,Master!B:AF,COLUMN(Master!$E$1)-1, FALSE))","v":""},{"$f":"IF(A55 = \"\", \"\",VLOOKUP('User Interface'!A55,Master!B:AF,COLUMN(Master!$C$1)-1, FALSE))","v":""},{"$f":"IF(A55 = \"\", \"\",VLOOKUP('User Interface'!A55,Master!B:AF,COLUMN(Master!$D$1)-1, FALSE))","v":""},{"$f":"IF(A55 = \"\", \"\",VLOOKUP('User Interface'!A55,Master!B:AF,COLUMN(Master!$F$1)-1, FALSE))","v":""},{"$f":"IF(A55 = \"\", \"\",VLOOKUP('User Interface'!A55,Master!B:AF,COLUMN(Master!$G$1)-1, FALSE))","v":""},{"$f":"IF(A55 = \"\", \"\",VLOOKUP('User Interface'!A55,Master!B:AF,COLUMN(Master!$H$1)-1, FALSE))","v":""}]
[null,{"$f":"IF(A56 = \"\", \"\",VLOOKUP('User Interface'!A56,Master!B:AF,COLUMN(Master!$E$1)-1, FALSE))","v":""},{"$f":"IF(A56 = \"\", \"\",VLOOKUP('User Interface'!A56,Master!B:AF,COLUMN(Master!$C$1)-1, FALSE))","v":""},{"$f":"IF(A56 = \"\", \"\",VLOOKUP('User Interface'!A56,Master!B:AF,COLUMN(Master!$D$1)-1, FALSE))","v":""},{"$f":"IF(A56 = \"\", \"\",VLOOKUP('User Interface'!A56,Master!B:AF,COLUMN(Master!$F$1)-1, FALSE))","v":""},{"$f":"IF(A56 = \"\", \"\",VLOOKUP('User Interface'!A56,Master!B:AF,COLUMN(Master!$G$1)-1, FALSE))","v":""},{"$f":"IF(A56 = \"\", \"\",VLOOKUP('User Interface'!A56,Master!B:AF,COLUMN(Master!$H$1)-1, FALSE))","v":""}]
[null,{"$f":"IF(A57 = \"\", \"\",VLOOKUP('User Interface'!A57,Master!B:AF,COLUMN(Master!$E$1)-1, FALSE))","v":""},{"$f":"IF(A57 = \"\", \"\",VLOOKUP('User Interface'!A57,Master!B:AF,COLUMN(Master!$C$1)-1, FALSE))","v":""},{"$f":"IF(A57 = \"\", \"\",VLOOKUP('User Interface'!A57,Master!B:AF,COLUMN(Master!$D$1)-1, FALSE))","v":""},{"$f":"IF(A57 = \"\", \"\",VLOOKUP('User Interface'!A57,Master!B:AF,COLUMN(Master!$F$1)-1, FALSE))","v":""},{"$f":"IF(A57 = \"\", \"\",VLOOKUP('User Interface'!A57,Master!B:AF,COLUMN(Master!$G$1)-1, FALSE))","v":""},{"$f":"IF(A57 = \"\", \"\",VLOOKUP('User Interface'!A57,Master!B:AF,COLUMN(Master!$H$1)-1, FALSE))","v":""}]
[null,{"$f":"IF(A58 = \"\", \"\",VLOOKUP('User Interface'!A58,Master!B:AF,COLUMN(Master!$E$1)-1, FALSE))","v":""},{"$f":"IF(A58 = \"\", \"\",VLOOKUP('User Interface'!A58,Master!B:AF,COLUMN(Master!$C$1)-1, FALSE))","v":""},{"$f":"IF(A58 = \"\", \"\",VLOOKUP('User Interface'!A58,Master!B:AF,COLUMN(Master!$D$1)-1, FALSE))","v":""},{"$f":"IF(A58 = \"\", \"\",VLOOKUP('User Interface'!A58,Master!B:AF,COLUMN(Master!$F$1)-1, FALSE))","v":""},{"$f":"IF(A58 = \"\", \"\",VLOOKUP('User Interface'!A58,Master!B:AF,COLUMN(Master!$G$1)-1, FALSE))","v":""},{"$f":"IF(A58 = \"\", \"\",VLOOKUP('User Interface'!A58,Master!B:AF,COLUMN(Master!$H$1)-1, FALSE))","v":""}]
[null,{"$f":"IF(A59 = \"\", \"\",VLOOKUP('User Interface'!A59,Master!B:AF,COLUMN(Master!$E$1)-1, FALSE))","v":""},{"$f":"IF(A59 = \"\", \"\",VLOOKUP('User Interface'!A59,Master!B:AF,COLUMN(Master!$C$1)-1, FALSE))","v":""},{"$f":"IF(A59 = \"\", \"\",VLOOKUP('User Interface'!A59,Master!B:AF,COLUMN(Master!$D$1)-1, FALSE))","v":""},{"$f":"IF(A59 = \"\", \"\",VLOOKUP('User Interface'!A59,Master!B:AF,COLUMN(Master!$F$1)-1, FALSE))","v":""},{"$f":"IF(A59 = \"\", \"\",VLOOKUP('User Interface'!A59,Master!B:AF,COLUMN(Master!$G$1)-1, FALSE))","v":""},{"$f":"IF(A59 = \"\", \"\",VLOOKUP('User Interface'!A59,Master!B:AF,COLUMN(Master!$H$1)-1, FALSE))","v":""}]
[null,{"$f":"IF(A60 = \"\", \"\",VLOOKUP('User Interface'!A60,Master!B:AF,COLUMN(Master!$E$1)-1, FALSE))","v":""},{"$f":"IF(A60 = \"\", \"\",VLOOKUP('User Interface'!A60,Master!B:AF,COLUMN(Master!$C$1)-1, FALSE))","v":""},{"$f":"IF(A60 = \"\", \"\",VLOOKUP('User Interface'!A60,Master!B:AF,COLUMN(Master!$D$1)-1, FALSE))","v":""},{"$f":"IF(A60 = \"\", \"\",VLOOKUP('User Interface'!A60,Master!B:AF,COLUMN(Master!$F$1)-1, FALSE))","v":""},{"$f":"IF(A60 = \"\", \"\",VLOOKUP('User Interface'!A60,Master!B:AF,COLUMN(Master!$G$1)-1, FALSE))","v":""},{"$f":"IF(A60 = \"\", \"\",VLOOKUP('User Interface'!A60,Master!B:AF,COLUMN(Master!$H$1)-1, FALSE))","v":""}]
[null,{"$f":"IF(A61 = \"\", \"\",VLOOKUP('User Interface'!A61,Master!B:AF,COLUMN(Master!$E$1)-1, FALSE))","v":""},{"$f":"IF(A61 = \"\", \"\",VLOOKUP('User Interface'!A61,Master!B:AF,COLUMN(Master!$C$1)-1, FALSE))","v":""},{"$f":"IF(A61 = \"\", \"\",VLOOKUP('User Interface'!A61,Master!B:AF,COLUMN(Master!$D$1)-1, FALSE))","v":""},{"$f":"IF(A61 = \"\", \"\",VLOOKUP('User Interface'!A61,Master!B:AF,COLUMN(Master!$F$1)-1, FALSE))","v":""},{"$f":"IF(A61 = \"\", \"\",VLOOKUP('User Interface'!A61,Master!B:AF,COLUMN(Master!$G$1)-1, FALSE))","v":""},{"$f":"IF(A61 = \"\", \"\",VLOOKUP('User Interface'!A61,Master!B:AF,COLUMN(Master!$H$1)-1, FALSE))","v":""}]
[null,{"$f":"IF(A62 = \"\", \"\",VLOOKUP('User Interface'!A62,Master!B:AF,COLUMN(Master!$E$1)-1, FALSE))","v":""},{"$f":"IF(A62 = \"\", \"\",VLOOKUP('User Interface'!A62,Master!B:AF,COLUMN(Master!$C$1)-1, FALSE))","v":""},{"$f":"IF(A62 = \"\", \"\",VLOOKUP('User Interface'!A62,Master!B:AF,COLUMN(Master!$D$1)-1, FALSE))","v":""},{"$f":"IF(A62 = \"\", \"\",VLOOKUP('User Interface'!A62,Master!B:AF,COLUMN(Master!$F$1)-1, FALSE))","v":""},{"$f":"IF(A62 = \"\", \"\",VLOOKUP('User Interface'!A62,Master!B:AF,COLUMN(Master!$G$1)-1, FALSE))","v":""},{"$f":"IF(A62 = \"\", \"\",VLOOKUP('User Interface'!A62,Master!B:AF,COLUMN(Master!$H$1)-1, FALSE))","v":""}]
[null,{"$f":"IF(A63 = \"\", \"\",VLOOKUP('User Interface'!A63,Master!B:AF,COLUMN(Master!$E$1)-1, FALSE))","v":""},{"$f":"IF(A63 = \"\", \"\",VLOOKUP('User Interface'!A63,Master!B:AF,COLUMN(Master!$C$1)-1, FALSE))","v":""},{"$f":"IF(A63 = \"\", \"\",VLOOKUP('User Interface'!A63,Master!B:AF,COLUMN(Master!$D$1)-1, FALSE))","v":""},{"$f":"IF(A63 = \"\", \"\",VLOOKUP('User Interface'!A63,Master!B:AF,COLUMN(Master!$F$1)-1, FALSE))","v":""},{"$f":"IF(A63 = \"\", \"\",VLOOKUP('User Interface'!A63,Master!B:AF,COLUMN(Master!$G$1)-1, FALSE))","v":""},{"$f":"IF(A63 = \"\", \"\",VLOOKUP('User Interface'!A63,Master!B:AF,COLUMN(Master!$H$1)-1, FALSE))","v":""}]
[null,{"$f":"IF(A64 = \"\", \"\",VLOOKUP('User Interface'!A64,Master!B:AF,COLUMN(Master!$E$1)-1, FALSE))","v":""},{"$f":"IF(A64 = \"\", \"\",VLOOKUP('User Interface'!A64,Master!B:AF,COLUMN(Master!$C$1)-1, FALSE))","v":""},{"$f":"IF(A64 = \"\", \"\",VLOOKUP('User Interface'!A64,Master!B:AF,COLUMN(Master!$D$1)-1, FALSE))","v":""},{"$f":"IF(A64 = \"\", \"\",VLOOKUP('User Interface'!A64,Master!B:AF,COLUMN(Master!$F$1)-1, FALSE))","v":""},{"$f":"IF(A64 = \"\", \"\",VLOOKUP('User Interface'!A64,Master!B:AF,COLUMN(Master!$G$1)-1, FALSE))","v":""},{"$f":"IF(A64 = \"\", \"\",VLOOKUP('User Interface'!A64,Master!B:AF,COLUMN(Master!$H$1)-1, FALSE))","v":""}]
[null,{"$f":"IF(A65 = \"\", \"\",VLOOKUP('User Interface'!A65,Master!B:AF,COLUMN(Master!$E$1)-1, FALSE))","v":""},{"$f":"IF(A65 = \"\", \"\",VLOOKUP('User Interface'!A65,Master!B:AF,COLUMN(Master!$C$1)-1, FALSE))","v":""},{"$f":"IF(A65 = \"\", \"\",VLOOKUP('User Interface'!A65,Master!B:AF,COLUMN(Master!$D$1)-1, FALSE))","v":""},{"$f":"IF(A65 = \"\", \"\",VLOOKUP('User Interface'!A65,Master!B:AF,COLUMN(Master!$F$1)-1, FALSE))","v":""},{"$f":"IF(A65 = \"\", \"\",VLOOKUP('User Interface'!A65,Master!B:AF,COLUMN(Master!$G$1)-1, FALSE))","v":""},{"$f":"IF(A65 = \"\", \"\",VLOOKUP('User Interface'!A65,Master!B:AF,COLUMN(Master!$H$1)-1, FALSE))","v":""}]
[null,{"$f":"IF(A66 = \"\", \"\",VLOOKUP('User Interface'!A66,Master!B:AF,COLUMN(Master!$E$1)-1, FALSE))","v":""},{"$f":"IF(A66 = \"\", \"\",VLOOKUP('User Interface'!A66,Master!B:AF,COLUMN(Master!$C$1)-1, FALSE))","v":""},{"$f":"IF(A66 = \"\", \"\",VLOOKUP('User Interface'!A66,Master!B:AF,COLUMN(Master!$D$1)-1, FALSE))","v":""},{"$f":"IF(A66 = \"\", \"\",VLOOKUP('User Interface'!A66,Master!B:AF,COLUMN(Master!$F$1)-1, FALSE))","v":""},{"$f":"IF(A66 = \"\", \"\",VLOOKUP('User Interface'!A66,Master!B:AF,COLUMN(Master!$G$1)-1, FALSE))","v":""},{"$f":"IF(A66 = \"\", \"\",VLOOKUP('User Interface'!A66,Master!B:AF,COLUMN(Master!$H$1)-1, FALSE))","v":""}]
[null,{"$f":"IF(A67 = \"\", \"\",VLOOKUP('User Interface'!A67,Master!B:AF,COLUMN(Master!$E$1)-1, FALSE))","v":""},{"$f":"IF(A67 = \"\", \"\",VLOOKUP('User Interface'!A67,Master!B:AF,COLUMN(Master!$C$1)-1, FALSE))","v":""},{"$f":"IF(A67 = \"\", \"\",VLOOKUP('User Interface'!A67,Master!B:AF,COLUMN(Master!$D$1)-1, FALSE))","v":""},{"$f":"IF(A67 = \"\", \"\",VLOOKUP('User Interface'!A67,Master!B:AF,COLUMN(Master!#REF!)-1, FALSE))","v":""},{"$f":"IF(A67 = \"\", \"\",VLOOKUP('User Interface'!A67,Master!B:AF,COLUMN(Master!#REF!)-1, FALSE))","v":""}]
[null,{"$f":"IF(A68 = \"\", \"\",VLOOKUP('User Interface'!A68,Master!B:AF,COLUMN(Master!$E$1)-1, FALSE))","v":""},{"$f":"IF(A68 = \"\", \"\",VLOOKUP('User Interface'!A68,Master!B:AF,COLUMN(Master!$C$1)-1, FALSE))","v":""},{"$f":"IF(A68 = \"\", \"\",VLOOKUP('User Interface'!A68,Master!B:AF,COLUMN(Master!$D$1)-1, FALSE))","v":""},{"$f":"IF(A68 = \"\", \"\",VLOOKUP('User Interface'!A68,Master!B:AF,COLUMN(Master!#REF!)-1, FALSE))","v":""},{"$f":"IF(A68 = \"\", \"\",VLOOKUP('User Interface'!A68,Master!B:AF,COLUMN(Master!#REF!)-1, FALSE))","v":""}]
[null,{"$f":"IF(A69 = \"\", \"\",VLOOKUP('User Interface'!A69,Master!B:AF,COLUMN(Master!$E$1)-1, FALSE))","v":""},{"$f":"IF(A69 = \"\", \"\",VLOOKUP('User Interface'!A69,Master!B:AF,COLUMN(Master!$C$1)-1, FALSE))","v":""},{"$f":"IF(A69 = \"\", \"\",VLOOKUP('User Interface'!A69,Master!B:AF,COLUMN(Master!$D$1)-1, FALSE))","v":""},{"$f":"IF(A69 = \"\", \"\",VLOOKUP('User Interface'!A69,Master!B:AF,COLUMN(Master!#REF!)-1, FALSE))","v":""},{"$f":"IF(A69 = \"\", \"\",VLOOKUP('User Interface'!A69,Master!B:AF,COLUMN(Master!#REF!)-1, FALSE))","v":""}]
[null,{"$f":"IF(A70 = \"\", \"\",VLOOKUP('User Interface'!A70,Master!B:AF,COLUMN(Master!$E$1)-1, FALSE))","v":""},{"$f":"IF(A70 = \"\", \"\",VLOOKUP('User Interface'!A70,Master!B:AF,COLUMN(Master!$C$1)-1, FALSE))","v":""},{"$f":"IF(A70 = \"\", \"\",VLOOKUP('User Interface'!A70,Master!B:AF,COLUMN(Master!$D$1)-1, FALSE))","v":""},{"$f":"IF(A70 = \"\", \"\",VLOOKUP('User Interface'!A70,Master!B:AF,COLUMN(Master!#REF!)-1, FALSE))","v":""},{"$f":"IF(A70 = \"\", \"\",VLOOKUP('User Interface'!A70,Master!B:AF,COLUMN(Master!#REF!)-1, FALSE))","v":""}]
[null,{"$f":"IF(A71 = \"\", \"\",VLOOKUP('User Interface'!A71,Master!B:AF,COLUMN(Master!$E$1)-1, FALSE))","v":""},{"$f":"IF(A71 = \"\", \"\",VLOOKUP('User Interface'!A71,Master!B:AF,COLUMN(Master!$C$1)-1, FALSE))","v":""},{"$f":"IF(A71 = \"\", \"\",VLOOKUP('User Interface'!A71,Master!B:AF,COLUMN(Master!$D$1)-1, FALSE))","v":""},{"$f":"IF(A71 = \"\", \"\",VLOOKUP('User Interface'!A71,Master!B:AF,COLUMN(Master!#REF!)-1, FALSE))","v":""},{"$f":"IF(A71 = \"\", \"\",VLOOKUP('User Interface'!A71,Master!B:AF,COLUMN(Master!#REF!)-1, FALSE))","v":""}]
[null,{"$f":"IF(A72 = \"\", \"\",VLOOKUP('User Interface'!A72,Master!B:AF,COLUMN(Master!$E$1)-1, FALSE))","v":""},{"$f":"IF(A72 = \"\", \"\",VLOOKUP('User Interface'!A72,Master!B:AF,COLUMN(Master!$C$1)-1, FALSE))","v":""},{"$f":"IF(A72 = \"\", \"\",VLOOKUP('User Interface'!A72,Master!B:AF,COLUMN(Master!$D$1)-1, FALSE))","v":""},{"$f":"IF(A72 = \"\", \"\",VLOOKUP('User Interface'!A72,Master!B:AF,COLUMN(Master!#REF!)-1, FALSE))","v":""},{"$f":"IF(A72 = \"\", \"\",VLOOKUP('User Interface'!A72,Master!B:AF,COLUMN(Master!#REF!)-1, FALSE))","v":""}]
[null,{"$f":"IF(A73 = \"\", \"\",VLOOKUP('User Interface'!A73,Master!B:AF,COLUMN(Master!$E$1)-1, FALSE))","v":""},{"$f":"IF(A73 = \"\", \"\",VLOOKUP('User Interface'!A73,Master!B:AF,COLUMN(Master!$C$1)-1, FALSE))","v":""},{"$f":"IF(A73 = \"\", \"\",VLOOKUP('User Interface'!A73,Master!B:AF,COLUMN(Master!$D$1)-1, FALSE))","v":""},{"$f":"IF(A73 = \"\", \"\",VLOOKUP('User Interface'!A73,Master!B:AF,COLUMN(Master!#REF!)-1, FALSE))","v":""},{"$f":"IF(A73 = \"\", \"\",VLOOKUP('User Interface'!A73,Master!B:AF,COLUMN(Master!#REF!)-1, FALSE))","v":""}]
[null,{"$f":"IF(A74 = \"\", \"\",VLOOKUP('User Interface'!A74,Master!B:AF,COLUMN(Master!$E$1)-1, FALSE))","v":""},{"$f":"IF(A74 = \"\", \"\",VLOOKUP('User Interface'!A74,Master!B:AF,COLUMN(Master!$C$1)-1, FALSE))","v":""},{"$f":"IF(A74 = \"\", \"\",VLOOKUP('User Interface'!A74,Master!B:AF,COLUMN(Master!$D$1)-1, FALSE))","v":""},{"$f":"IF(A74 = \"\", \"\",VLOOKUP('User Interface'!A74,Master!B:AF,COLUMN(Master!#REF!)-1, FALSE))","v":""},{"$f":"IF(A74 = \"\", \"\",VLOOKUP('User Interface'!A74,Master!B:AF,COLUMN(Master!#REF!)-1, FALSE))","v":""}]
[null,{"$f":"IF(A75 = \"\", \"\",VLOOKUP('User Interface'!A75,Master!B:AF,COLUMN(Master!$E$1)-1, FALSE))","v":""},{"$f":"IF(A75 = \"\", \"\",VLOOKUP('User Interface'!A75,Master!B:AF,COLUMN(Master!$C$1)-1, FALSE))","v":""},{"$f":"IF(A75 = \"\", \"\",VLOOKUP('User Interface'!A75,Master!B:AF,COLUMN(Master!$D$1)-1, FALSE))","v":""},{"$f":"IF(A75 = \"\", \"\",VLOOKUP('User Interface'!A75,Master!B:AF,COLUMN(Master!#REF!)-1, FALSE))","v":""},{"$f":"IF(A75 = \"\", \"\",VLOOKUP('User Interface'!A75,Master!B:AF,COLUMN(Master!#REF!)-1, FALSE))","v":""}]
[null,{"$f":"IF(A76 = \"\", \"\",VLOOKUP('User Interface'!A76,Master!B:AF,COLUMN(Master!$E$1)-1, FALSE))","v":""},{"$f":"IF(A76 = \"\", \"\",VLOOKUP('User Interface'!A76,Master!B:AF,COLUMN(Master!$C$1)-1, FALSE))","v":""},{"$f":"IF(A76 = \"\", \"\",VLOOKUP('User Interface'!A76,Master!B:AF,COLUMN(Master!$D$1)-1, FALSE))","v":""},{"$f":"IF(A76 = \"\", \"\",VLOOKUP('User Interface'!A76,Master!B:AF,COLUMN(Master!#REF!)-1, FALSE))","v":""},{"$f":"IF(A76 = \"\", \"\",VLOOKUP('User Interface'!A76,Master!B:AF,COLUMN(Master!#REF!)-1, FALSE))","v":""}]
[null,{"$f":"IF(A77 = \"\", \"\",VLOOKUP('User Interface'!A77,Master!B:AF,COLUMN(Master!$E$1)-1, FALSE))","v":""},{"$f":"IF(A77 = \"\", \"\",VLOOKUP('User Interface'!A77,Master!B:AF,COLUMN(Master!$C$1)-1, FALSE))","v":""},{"$f":"IF(A77 = \"\", \"\",VLOOKUP('User Interface'!A77,Master!B:AF,COLUMN(Master!$D$1)-1, FALSE))","v":""},{"$f":"IF(A77 = \"\", \"\",VLOOKUP('User Interface'!A77,Master!B:AF,COLUMN(Master!G3)-1, FALSE))","v":""},{"$f":"IF(A77 = \"\", \"\",VLOOKUP('User Interface'!A77,Master!B:AF,COLUMN(Master!H3)-1, FALSE))","v":""}]
[null,{"$f":"IF(A78 = \"\", \"\",VLOOKUP('User Interface'!A78,Master!B:AF,COLUMN(Master!$E$1)-1, FALSE))","v":""},{"$f":"IF(A78 = \"\", \"\",VLOOKUP('User Interface'!A78,Master!B:AF,COLUMN(Master!$C$1)-1, FALSE))","v":""},{"$f":"IF(A78 = \"\", \"\",VLOOKUP('User Interface'!A78,Master!B:AF,COLUMN(Master!$D$1)-1, FALSE))","v":""},{"$f":"IF(A78 = \"\", \"\",VLOOKUP('User Interface'!A78,Master!B:AF,COLUMN(Master!#REF!)-1, FALSE))","v":""},{"$f":"IF(A78 = \"\", \"\",VLOOKUP('User Interface'!A78,Master!B:AF,COLUMN(Master!#REF!)-1, FALSE))","v":""}]
[null,{"$f":"IF(A79 = \"\", \"\",VLOOKUP('User Interface'!A79,Master!B:AF,COLUMN(Master!$E$1)-1, FALSE))","v":""},{"$f":"IF(A79 = \"\", \"\",VLOOKUP('User Interface'!A79,Master!B:AF,COLUMN(Master!$C$1)-1, FALSE))","v":""},{"$f":"IF(A79 = \"\", \"\",VLOOKUP('User Interface'!A79,Master!B:AF,COLUMN(Master!$D$1)-1, FALSE))","v":""},{"$f":"IF(A79 = \"\", \"\",VLOOKUP('User Interface'!A79,Master!B:AF,COLUMN(Master!#REF!)-1, FALSE))","v":""},{"$f":"IF(A79 = \"\", \"\",VLOOKUP('User Interface'!A79,Master!B:AF,COLUMN(Master!#REF!)-1, FALSE))","v":""}]
[null,{"$f":"IF(A80 = \"\", \"\",VLOOKUP('User Interface'!A80,Master!B:AF,COLUMN(Master!$E$1)-1, FALSE))","v":""},{"$f":"IF(A80 = \"\", \"\",VLOOKUP('User Interface'!A80,Master!B:AF,COLUMN(Master!$C$1)-1, FALSE))","v":""},{"$f":"IF(A80 = \"\", \"\",VLOOKUP('User Interface'!A80,Master!B:AF,COLUMN(Master!$D$1)-1, FALSE))","v":""},{"$f":"IF(A80 = \"\", \"\",VLOOKUP('User Interface'!A80,Master!B:AF,COLUMN(Master!G4)-1, FALSE))","v":""},{"$f":"IF(A80 = \"\", \"\",VLOOKUP('User Interface'!A80,Master!B:AF,COLUMN(Master!H4)-1, FALSE))","v":""}]
[null,{"$f":"IF(A81 = \"\", \"\",VLOOKUP('User Interface'!A81,Master!B:AF,COLUMN(Master!$E$1)-1, FALSE))","v":""},{"$f":"IF(A81 = \"\", \"\",VLOOKUP('User Interface'!A81,Master!B:AF,COLUMN(Master!$C$1)-1, FALSE))","v":""},{"$f":"IF(A81 = \"\", \"\",VLOOKUP('User Interface'!A81,Master!B:AF,COLUMN(Master!$D$1)-1, FALSE))","v":""},{"$f":"IF(A81 = \"\", \"\",VLOOKUP('User Interface'!A81,Master!B:AF,COLUMN(Master!#REF!)-1, FALSE))","v":""},{"$f":"IF(A81 = \"\", \"\",VLOOKUP('User Interface'!A81,Master!B:AF,COLUMN(Master!#REF!)-1, FALSE))","v":""}]
[null,{"$f":"IF(A82 = \"\", \"\",VLOOKUP('User Interface'!A82,Master!B:AF,COLUMN(Master!$E$1)-1, FALSE))","v":""},{"$f":"IF(A82 = \"\", \"\",VLOOKUP('User Interface'!A82,Master!B:AF,COLUMN(Master!$C$1)-1, FALSE))","v":""},{"$f":"IF(A82 = \"\", \"\",VLOOKUP('User Interface'!A82,Master!B:AF,COLUMN(Master!$D$1)-1, FALSE))","v":""},{"$f":"IF(A82 = \"\", \"\",VLOOKUP('User Interface'!A82,Master!B:AF,COLUMN(Master!#REF!)-1, FALSE))","v":""},{"$f":"IF(A82 = \"\", \"\",VLOOKUP('User Interface'!A82,Master!B:AF,COLUMN(Master!#REF!)-1, FALSE))","v":""}]
[null,{"$f":"IF(A83 = \"\", \"\",VLOOKUP('User Interface'!A83,Master!B:AF,COLUMN(Master!$E$1)-1, FALSE))","v":""},{"$f":"IF(A83 = \"\", \"\",VLOOKUP('User Interface'!A83,Master!B:AF,COLUMN(Master!$C$1)-1, FALSE))","v":""},{"$f":"IF(A83 = \"\", \"\",VLOOKUP('User Interface'!A83,Master!B:AF,COLUMN(Master!$D$1)-1, FALSE))","v":""},{"$f":"IF(A83 = \"\", \"\",VLOOKUP('User Interface'!A83,Master!B:AF,COLUMN(Master!#REF!)-1, FALSE))","v":""},{"$f":"IF(A83 = \"\", \"\",VLOOKUP('User Interface'!A83,Master!B:AF,COLUMN(Master!#REF!)-1, FALSE))","v":""}]
[null,{"$f":"IF(A84 = \"\", \"\",VLOOKUP('User Interface'!A84,Master!B:AF,COLUMN(Master!$E$1)-1, FALSE))","v":""},{"$f":"IF(A84 = \"\", \"\",VLOOKUP('User Interface'!A84,Master!B:AF,COLUMN(Master!$C$1)-1, FALSE))","v":""},{"$f":"IF(A84 = \"\", \"\",VLOOKUP('User Interface'!A84,Master!B:AF,COLUMN(Master!$D$1)-1, FALSE))","v":""},{"$f":"IF(A84 = \"\", \"\",VLOOKUP('User Interface'!A84,Master!B:AF,COLUMN(Master!#REF!)-1, FALSE))","v":""},{"$f":"IF(A84 = \"\", \"\",VLOOKUP('User Interface'!A84,Master!B:AF,COLUMN(Master!#REF!)-1, FALSE))","v":""}]
[null,{"$f":"IF(A85 = \"\", \"\",VLOOKUP('User Interface'!A85,Master!B:AF,COLUMN(Master!$E$1)-1, FALSE))","v":""},{"$f":"IF(A85 = \"\", \"\",VLOOKUP('User Interface'!A85,Master!B:AF,COLUMN(Master!$C$1)-1, FALSE))","v":""},{"$f":"IF(A85 = \"\", \"\",VLOOKUP('User Interface'!A85,Master!B:AF,COLUMN(Master!$D$1)-1, FALSE))","v":""},{"$f":"IF(A85 = \"\", \"\",VLOOKUP('User Interface'!A85,Master!B:AF,COLUMN(Master!#REF!)-1, FALSE))","v":""},{"$f":"IF(A85 = \"\", \"\",VLOOKUP('User Interface'!A85,Master!B:AF,COLUMN(Master!#REF!)-1, FALSE))","v":""}]
[null,{"$f":"IF(A86 = \"\", \"\",VLOOKUP('User Interface'!A86,Master!B:AF,COLUMN(Master!$E$1)-1, FALSE))","v":""},{"$f":"IF(A86 = \"\", \"\",VLOOKUP('User Interface'!A86,Master!B:AF,COLUMN(Master!$C$1)-1, FALSE))","v":""},{"$f":"IF(A86 = \"\", \"\",VLOOKUP('User Interface'!A86,Master!B:AF,COLUMN(Master!$D$1)-1, FALSE))","v":""},{"$f":"IF(A86 = \"\", \"\",VLOOKUP('User Interface'!A86,Master!B:AF,COLUMN(Master!#REF!)-1, FALSE))","v":""},{"$f":"IF(A86 = \"\", \"\",VLOOKUP('User Interface'!A86,Master!B:AF,COLUMN(Master!#REF!)-1, FALSE))","v":""}]
[null,{"$f":"IF(A87 = \"\", \"\",VLOOKUP('User Interface'!A87,Master!B:AF,COLUMN(Master!$E$1)-1, FALSE))","v":""},{"$f":"IF(A87 = \"\", \"\",VLOOKUP('User Interface'!A87,Master!B:AF,COLUMN(Master!$C$1)-1, FALSE))","v":""},{"$f":"IF(A87 = \"\", \"\",VLOOKUP('User Interface'!A87,Master!B:AF,COLUMN(Master!$D$1)-1, FALSE))","v":""},{"$f":"IF(A87 = \"\", \"\",VLOOKUP('User Interface'!A87,Master!B:AF,COLUMN(Master!#REF!)-1, FALSE))","v":""},{"$f":"IF(A87 = \"\", \"\",VLOOKUP('User Interface'!A87,Master!B:AF,COLUMN(Master!#REF!)-1, FALSE))","v":""}]
[null,{"$f":"IF(A88 = \"\", \"\",VLOOKUP('User Interface'!A88,Master!B:AF,COLUMN(Master!$E$1)-1, FALSE))","v":""},{"$f":"IF(A88 = \"\", \"\",VLOOKUP('User Interface'!A88,Master!B:AF,COLUMN(Master!$C$1)-1, FALSE))","v":""},{"$f":"IF(A88 = \"\", \"\",VLOOKUP('User Interface'!A88,Master!B:AF,COLUMN(Master!$D$1)-1, FALSE))","v":""},{"$f":"IF(A88 = \"\", \"\",VLOOKUP('User Interface'!A88,Master!B:AF,COLUMN(Master!#REF!)-1, FALSE))","v":""},{"$f":"IF(A88 = \"\", \"\",VLOOKUP('User Interface'!A88,Master!B:AF,COLUMN(Master!#REF!)-1, FALSE))","v":""}]
[null,{"$f":"IF(A89 = \"\", \"\",VLOOKUP('User Interface'!A89,Master!B:AF,COLUMN(Master!$E$1)-1, FALSE))","v":""},{"$f":"IF(A89 = \"\", \"\",VLOOKUP('User Interface'!A89,Master!B:AF,COLUMN(Master!$C$1)-1, FALSE))","v":""},{"$f":"IF(A89 = \"\", \"\",VLOOKUP('User Interface'!A89,Master!B:AF,COLUMN(Master!$D$1)-1, FALSE))","v":""},{"$f":"IF(A89 = \"\", \"\",VLOOKUP('User Interface'!A89,Master!B:AF,COLUMN(Master!#REF!)-1, FALSE))","v":""},{"$f":"IF(A89 = \"\", \"\",VLOOKUP('User Interface'!A89,Master!B:AF,COLUMN(Master!#REF!)-1, FALSE))","v":""}]

{"sheet":"Storage & Containment","index":4,"n_rows":121,"n_cols":13,"rows_kept":121,"cut":false,"hidden":false,"merged":[]}
["STORAGE & CONTAINMENT",null,"If treatment is onsite, proceed to the Use & Disposal tab, bypassing the Conveyance and Treatment tabs."]
[null,null,"When listed, always include \"Either\" in your selection so that all appropriate technologies are listed. "]
[]
[]
[]
[]
[]
[]
[]
[]
[]
[]
[]
[]
[]
[]
[]
[]
[]
[]
[]
[]
["Phase","Storage and containment"]
["Method of use","(All)"]
["Number of users","(All)"]
["Technology",{"$f":"Master!L1","v":"Number of users"},{"$f":"Master!M1","v":"Containment "},{"$f":"Master!N1","v":"Suitable for high water table or flood prone area"},{"$f":"Master!O1","v":"Minimum available space"},"Removal method(s)",{"$f":"Master!Q1","v":"Treatment"},"Outputs for reuse",{"$f":"Master!C1","v":"Method of use"},{"$f":"Master!D1","v":"Urine diverting"},"Type of system",{"$f":"Master!S1","v":"Availability"},{"$f":"Master!T1","v":"Proceed to"}]
["Airhead Composting Toilet",{"$f":"IF(A27 = \"\", \"\",VLOOKUP(A27,Master!$B$12:$T$78,COLUMN(Master!$L$1)-1, FALSE))","v":"Household"},{"$f":"IF(A27 = \"\", \"\",VLOOKUP(A27,Master!$B$12:$T$78,COLUMN(Master!$M$1)-1, FALSE))","v":"Above ground"},{"$f":"IF(A27 = \"\", \"\",VLOOKUP(A27,Master!$B$12:$T$78,COLUMN(Master!$N$1)-1, FALSE))","v":"Yes"},{"$f":"IF(A27 = \"\", \"\",VLOOKUP(A27,Master!$B$12:$T$78,COLUMN(Master!$O$1)-1, FALSE))","v":"0-9m²"},{"$f":"IF(A27 = \"\", \"\",VLOOKUP(A27,Master!$B$12:$T$78,COLUMN(Master!$P$1)-1, FALSE))","v":"Container"},{"$f":"IF(A27 = \"\", \"\",VLOOKUP(A27,Master!$B$12:$T$78,COLUMN(Master!$Q$1)-1, FALSE))","v":"Offsite"},{"$f":"IF(A27 = \"\", \"\",VLOOKUP(A27,Master!$B$12:$T$78,COLUMN(Master!$R$1)-1, FALSE))","v":"Compost"},{"$f":"IF(A27 = \"\", \"\",VLOOKUP(A27,Master!$B$12:$T$78,COLUMN(Master!$C$1)-1, FALSE))","v":"Container"},{"$f":"IF(A27 = \"\", \"\",VLOOKUP(A27,Master!$B$12:$T$78,COLUMN(Master!$D$1)-1, FALSE))","v":"Yes"},{"$f":"IF(A27 = \"\", \"\",VLOOKUP(A27,Master!$B$12:$T$78,COLUMN(Master!$K$1)-1, FALSE))","v":"Dry"},{"$f":"IF(A27 = \"\", \"\",VLOOKUP(A27,Master!$B$12:$T$78,COLUMN(Master!$S$1)-1, FALSE))","v":"For purchase"},{"$f":"IF(A27 = \"\", \"\",VLOOKUP(A27,Master!$B$12:$T$78,COLUMN(Master!$T$1)-1, FALSE))","v":"Conveyance"}]
["Aqua Privys (Septic Tank)",{"$f":"IF(A28 = \"\", \"\",VLOOKUP(A28,Master!$B$12:$T$78,COLUMN(Master!$L$1)-1, FALSE))","v":"Either"},{"$f":"IF(A28 = \"\", \"\",VLOOKUP(A28,Master!$B$12:$T$78,COLUMN(Master!$M$1)-1, FALSE))","v":"Below ground"},{"$f":"IF(A28 = \"\", \"\",VLOOKUP(A28,Master!$B$12:$T$78,COLUMN(Master!$N$1)-1, FALSE))","v":"No"},{"$f":"IF(A28 = \"\", \"\",VLOOKUP(A28,Master!$B$12:$T$78,COLUMN(Master!$O$1)-1, FALSE))","v":"9-49m²"},{"$f":"IF(A28 = \"\", \"\",VLOOKUP(A28,Master!$B$12:$T$78,COLUMN(Master!$P$1)-1, FALSE))","v":"Manual/Pump"},{"$f":"IF(A28 = \"\", \"\",VLOOKUP(A28,Master!$B$12:$T$78,COLUMN(Master!$Q$1)-1, FALSE))","v":"Offsite"},{"$f":"IF(A28 = \"\", \"\",VLOOKUP(A28,Master!$B$12:$T$78,COLUMN(Master!$R$1)-1, FALSE))","v":"None"},{"$f":"IF(A28 = \"\", \"\",VLOOKUP(A28,Master!$B$12:$T$78,COLUMN(Master!$C$1)-1, FALSE))","v":"Sit/Squat"},{"$f":"IF(A28 = \"\", \"\",VLOOKUP(A28,Master!$B$12:$T$78,COLUMN(Master!$D$1)-1, FALSE))","v":"No"},{"$f":"IF(A28 = \"\", \"\",VLOOKUP(A28,Master!$B$12:$T$78,COLUMN(Master!$K$1)-1, FALSE))","v":"Wet"},{"$f":"IF(A28 = \"\", \"\",VLOOKUP(A28,Master!$B$12:$T$78,COLUMN(Master!$S$1)-1, FALSE))","v":"For purchase"},{"$f":"IF(A28 = \"\", \"\",VLOOKUP(A28,Master!$B$12:$T$78,COLUMN(Master!$T$1)-1, FALSE))","v":"Conveyance"}]
["Aquatron Toilet",{"$f":"IF(A29 = \"\", \"\",VLOOKUP(A29,Master!$B$12:$T$78,COLUMN(Master!$L$1)-1, FALSE))","v":"Household"},{"$f":"IF(A29 = \"\", \"\",VLOOKUP(A29,Master!$B$12:$T$78,COLUMN(Master!$M$1)-1, FALSE))","v":"Container"},{"$f":"IF(A29 = \"\", \"\",VLOOKUP(A29,Master!$B$12:$T$78,COLUMN(Master!$N$1)-1, FALSE))","v":"No"},{"$f":"IF(A29 = \"\", \"\",VLOOKUP(A29,Master!$B$12:$T$78,COLUMN(Master!$O$1)-1, FALSE))","v":"0-9m²"},{"$f":"IF(A29 = \"\", \"\",VLOOKUP(A29,Master!$B$12:$T$78,COLUMN(Master!$P$1)-1, FALSE))","v":"Container"},{"$f":"IF(A29 = \"\", \"\",VLOOKUP(A29,Master!$B$12:$T$78,COLUMN(Master!$Q$1)-1, FALSE))","v":"Offsite"},{"$f":"IF(A29 = \"\", \"\",VLOOKUP(A29,Master!$B$12:$T$78,COLUMN(Master!$R$1)-1, FALSE))","v":"Compost"},{"$f":"IF(A29 = \"\", \"\",VLOOKUP(A29,Master!$B$12:$T$78,COLUMN(Master!$C$1)-1, FALSE))","v":"Container"},{"$f":"IF(A29 = \"\", \"\",VLOOKUP(A29,Master!$B$12:$T$78,COLUMN(Master!$D$1)-1, FALSE))","v":"Yes"},{"$f":"IF(A29 = \"\", \"\",VLOOKUP(A29,Master!$B$12:$T$78,COLUMN(Master!$K$1)-1, FALSE))","v":"Wet"},{"$f":"IF(A29 = \"\", \"\",VLOOKUP(A29,Master!$B$12:$T$78,COLUMN(Master!$S$1)-1, FALSE))","v":"For purchase"},{"$f":"IF(A29 = \"\", \"\",VLOOKUP(A29,Master!$B$12:$T$78,COLUMN(Master!$T$1)-1, FALSE))","v":"Conveyance"}]
["Arborloo",{"$f":"IF(A30 = \"\", \"\",VLOOKUP(A30,Master!$B$12:$T$78,COLUMN(Master!$L$1)-1, FALSE))","v":"Household"},{"$f":"IF(A30 = \"\", \"\",VLOOKUP(A30,Master!$B$12:$T$78,COLUMN(Master!$M$1)-1, FALSE))","v":"Below ground"},{"$f":"IF(A30 = \"\", \"\",VLOOKUP(A30,Master!$B$12:$T$78,COLUMN(Master!$N$1)-1, FALSE))","v":"No"},{"$f":"IF(A30 = \"\", \"\",VLOOKUP(A30,Master!$B$12:$T$78,COLUMN(Master!$O$1)-1, FALSE))","v":"0-9m²"},{"$f":"IF(A30 = \"\", \"\",VLOOKUP(A30,Master!$B$12:$T$78,COLUMN(Master!$P$1)-1, FALSE))","v":"NA"},{"$f":"IF(A30 = \"\", \"\",VLOOKUP(A30,Master!$B$12:$T$78,COLUMN(Master!$Q$1)-1, FALSE))","v":"Onsite"},{"$f":"IF(A30 = \"\", \"\",VLOOKUP(A30,Master!$B$12:$T$78,COLUMN(Master!$R$1)-1, FALSE))","v":"None"},{"$f":"IF(A30 = \"\", \"\",VLOOKUP(A30,Master!$B$12:$T$78,COLUMN(Master!$C$1)-1, FALSE))","v":"Sit/Squat"},{"$f":"IF(A30 = \"\", \"\",VLOOKUP(A30,Master!$B$12:$T$78,COLUMN(Master!$D$1)-1, FALSE))","v":"Yes"},{"$f":"IF(A30 = \"\", \"\",VLOOKUP(A30,Master!$B$12:$T$78,COLUMN(Master!$K$1)-1, FALSE))","v":"Dry"},{"$f":"IF(A30 = \"\", \"\",VLOOKUP(A30,Master!$B$12:$T$78,COLUMN(Master!$S$1)-1, FALSE))","v":"Open source"},{"$f":"IF(A30 = \"\", \"\",VLOOKUP(A30,Master!$B$12:$T$78,COLUMN(Master!$T$1)-1, FALSE))","v":"Use and/or disposal"}]
["Banos Mejorados Secos Design",{"$f":"IF(A31 = \"\", \"\",VLOOKUP(A31,Master!$B$12:$T$78,COLUMN(Master!$L$1)-1, FALSE))","v":"Household"},{"$f":"IF(A31 = \"\", \"\",VLOOKUP(A31,Master!$B$12:$T$78,COLUMN(Master!$M$1)-1, FALSE))","v":"Above ground"},{"$f":"IF(A31 = \"\", \"\",VLOOKUP(A31,Master!$B$12:$T$78,COLUMN(Master!$N$1)-1, FALSE))","v":"Yes"},{"$f":"IF(A31 = \"\", \"\",VLOOKUP(A31,Master!$B$12:$T$78,COLUMN(Master!$O$1)-1, FALSE))","v":"0-9m²"},{"$f":"IF(A31 = \"\", \"\",VLOOKUP(A31,Master!$B$12:$T$78,COLUMN(Master!$P$1)-1, FALSE))","v":"Manual/Pump"},{"$f":"IF(A31 = \"\", \"\",VLOOKUP(A31,Master!$B$12:$T$78,COLUMN(Master!$Q$1)-1, FALSE))","v":"Offsite"},{"$f":"IF(A31 = \"\", \"\",VLOOKUP(A31,Master!$B$12:$T$78,COLUMN(Master!$R$1)-1, FALSE))","v":"Compost"},{"$f":"IF(A31 = \"\", \"\",VLOOKUP(A31,Master!$B$12:$T$78,COLUMN(Master!$C$1)-1, FALSE))","v":"Sit"},{"$f":"IF(A31 = \"\", \"\",VLOOKUP(A31,Master!$B$12:$T$78,COLUMN(Master!$D$1)-1, FALSE))","v":"Yes"},{"$f":"IF(A31 = \"\", \"\",VLOOKUP(A31,Master!$B$12:$T$78,COLUMN(Master!$K$1)-1, FALSE))","v":"Dry"},{"$f":"IF(A31 = \"\", \"\",VLOOKUP(A31,Master!$B$12:$T$78,COLUMN(Master!$S$1)-1, FALSE))","v":"For purchase"},{"$f":"IF(A31 = \"\", \"\",VLOOKUP(A31,Master!$B$12:$T$78,COLUMN(Master!$T$1)-1, FALSE))","v":"Conveyance "}]
["Biofil Digester",{"$f":"IF(A32 = \"\", \"\",VLOOKUP(A32,Master!$B$12:$T$78,COLUMN(Master!$L$1)-1, FALSE))","v":"Household"},{"$f":"IF(A32 = \"\", \"\",VLOOKUP(A32,Master!$B$12:$T$78,COLUMN(Master!$M$1)-1, FALSE))","v":"Above ground"},{"$f":"IF(A32 = \"\", \"\",VLOOKUP(A32,Master!$B$12:$T$78,COLUMN(Master!$N$1)-1, FALSE))","v":"Yes"},{"$f":"IF(A32 = \"\", \"\",VLOOKUP(A32,Master!$B$12:$T$78,COLUMN(Master!$O$1)-1, FALSE))","v":"9-49m²"},{"$f":"IF(A32 = \"\", \"\",VLOOKUP(A32,Master!$B$12:$T$78,COLUMN(Master!$P$1)-1, FALSE))","v":"NA"},{"$f":"IF(A32 = \"\", \"\",VLOOKUP(A32,Master!$B$12:$T$78,COLUMN(Master!$Q$1)-1, FALSE))","v":"Onsite"},{"$f":"IF(A32 = \"\", \"\",VLOOKUP(A32,Master!$B$12:$T$78,COLUMN(Master!$R$1)-1, FALSE))","v":"Compost"},{"$f":"IF(A32 = \"\", \"\",VLOOKUP(A32,Master!$B$12:$T$78,COLUMN(Master!$C$1)-1, FALSE))","v":"Sit/Squat"},{"$f":"IF(A32 = \"\", \"\",VLOOKUP(A32,Master!$B$12:$T$78,COLUMN(Master!$D$1)-1, FALSE))","v":"No"},{"$f":"IF(A32 = \"\", \"\",VLOOKUP(A32,Master!$B$12:$T$78,COLUMN(Master!$K$1)-1, FALSE))","v":"Wet"},{"$f":"IF(A32 = \"\", \"\",VLOOKUP(A32,Master!$B$12:$T$78,COLUMN(Master!$S$1)-1, FALSE))","v":"For purchase"},{"$f":"IF(A32 = \"\", \"\",VLOOKUP(A32,Master!$B$12:$T$78,COLUMN(Master!$T$1)-1, FALSE))","v":"Use and/or disposal"}]
["BioSanGas Toilet and Biogas System",{"$f":"IF(A33 = \"\", \"\",VLOOKUP(A33,Master!$B$12:$T$78,COLUMN(Master!$L$1)-1, FALSE))","v":"Community"},{"$f":"IF(A33 = \"\", \"\",VLOOKUP(A33,Master!$B$12:$T$78,COLUMN(Master!$M$1)-1, FALSE))","v":"Above ground"},{"$f":"IF(A33 = \"\", \"\",VLOOKUP(A33,Master!$B$12:$T$78,COLUMN(Master!$N$1)-1, FALSE))","v":"Yes"},{"$f":"IF(A33 = \"\", \"\",VLOOKUP(A33,Master!$B$12:$T$78,COLUMN(Master!$O$1)-1, FALSE))","v":"9-49m²"},{"$f":"IF(A33 = \"\", \"\",VLOOKUP(A33,Master!$B$12:$T$78,COLUMN(Master!$P$1)-1, FALSE))","v":"NA"},{"$f":"IF(A33 = \"\", \"\",VLOOKUP(A33,Master!$B$12:$T$78,COLUMN(Master!$Q$1)-1, FALSE))","v":"Onsite"},{"$f":"IF(A33 = \"\", \"\",VLOOKUP(A33,Master!$B$12:$T$78,COLUMN(Master!$R$1)-1, FALSE))","v":"Biogas"},{"$f":"IF(A33 = \"\", \"\",VLOOKUP(A33,Master!$B$12:$T$78,COLUMN(Master!$C$1)-1, FALSE))","v":"Sit"},{"$f":"IF(A33 = \"\", \"\",VLOOKUP(A33,Master!$B$12:$T$78,COLUMN(Master!$D$1)-1, FALSE))","v":"No"},{"$f":"IF(A33 = \"\", \"\",VLOOKUP(A33,Master!$B$12:$T$78,COLUMN(Master!$K$1)-1, FALSE))","v":"Wet"},{"$f":"IF(A33 = \"\", \"\",VLOOKUP(A33,Master!$B$12:$T$78,COLUMN(Master!$S$1)-1, FALSE))","v":"For purchase"},{"$f":"IF(A33 = \"\", \"\",VLOOKUP(A33,Master!$B$12:$T$78,COLUMN(Master!$T$1)-1, FALSE))","v":"Use and/or disposal"}]
["Blue Diversion Toilet ",{"$f":"IF(A34 = \"\", \"\",VLOOKUP(A34,Master!$B$12:$T$78,COLUMN(Master!$L$1)-1, FALSE))","v":"Either"},{"$f":"IF(A34 = \"\", \"\",VLOOKUP(A34,Master!$B$12:$T$78,COLUMN(Master!$M$1)-1, FALSE))","v":"Container"},{"$f":"IF(A34 = \"\", \"\",VLOOKUP(A34,Master!$B$12:$T$78,COLUMN(Master!$N$1)-1, FALSE))","v":"Yes"},{"$f":"IF(A34 = \"\", \"\",VLOOKUP(A34,Master!$B$12:$T$78,COLUMN(Master!$O$1)-1, FALSE))","v":"0-9m²"},{"$f":"IF(A34 = \"\", \"\",VLOOKUP(A34,Master!$B$12:$T$78,COLUMN(Master!$P$1)-1, FALSE))","v":"Container"},{"$f":"IF(A34 = \"\", \"\",VLOOKUP(A34,Master!$B$12:$T$78,COLUMN(Master!$Q$1)-1, FALSE))","v":"Offsite"},{"$f":"IF(A34 = \"\", \"\",VLOOKUP(A34,Master!$B$12:$T$78,COLUMN(Master!$R$1)-1, FALSE))","v":"Compost"},{"$f":"IF(A34 = \"\", \"\",VLOOKUP(A34,Master!$B$12:$T$78,COLUMN(Master!$C$1)-1, FALSE))","v":"Container"},{"$f":"IF(A34 = \"\", \"\",VLOOKUP(A34,Master!$B$12:$T$78,COLUMN(Master!$D$1)-1, FALSE))","v":"Yes"},{"$f":"IF(A34 = \"\", \"\",VLOOKUP(A34,Master!$B$12:$T$78,COLUMN(Master!$K$1)-1, FALSE))","v":"Dry"},{"$f":"IF(A34 = \"\", \"\",VLOOKUP(A34,Master!$B$12:$T$78,COLUMN(Master!$S$1)-1, FALSE))","v":"In development"},{"$f":"IF(A34 = \"\", \"\",VLOOKUP(A34,Master!$B$12:$T$78,COLUMN(Master!$T$1)-1, FALSE))","v":"Conveyance"}]
["Bristol Emergency Chemical Toilet",{"$f":"IF(A35 = \"\", \"\",VLOOKUP(A35,Master!$B$12:$T$78,COLUMN(Master!$L$1)-1, FALSE))","v":"Household"},{"$f":"IF(A35 = \"\", \"\",VLOOKUP(A35,Master!$B$12:$T$78,COLUMN(Master!$M$1)-1, FALSE))","v":"Container"},{"$f":"IF(A35 = \"\", \"\",VLOOKUP(A35,Master!$B$12:$T$78,COLUMN(Master!$N$1)-1, FALSE))","v":"Yes"},{"$f":"IF(A35 = \"\", \"\",VLOOKUP(A35,Master!$B$12:$T$78,COLUMN(Master!$O$1)-1, FALSE))","v":"0-9m²"},{"$f":"IF(A35 = \"\", \"\",VLOOKUP(A35,Master!$B$12:$T$78,COLUMN(Master!$P$1)-1, FALSE))","v":"Container"},{"$f":"IF(A35 = \"\", \"\",VLOOKUP(A35,Master!$B$12:$T$78,COLUMN(Master!$Q$1)-1, FALSE))","v":"Offsite"},{"$f":"IF(A35 = \"\", \"\",VLOOKUP(A35,Master!$B$12:$T$78,COLUMN(Master!$R$1)-1, FALSE))","v":"None"},{"$f":"IF(A35 = \"\", \"\",VLOOKUP(A35,Master!$B$12:$T$78,COLUMN(Master!$C$1)-1, FALSE))","v":"Container"},{"$f":"IF(A35 = \"\", \"\",VLOOKUP(A35,Master!$B$12:$T$78,COLUMN(Master!$D$1)-1, FALSE))","v":"No"},{"$f":"IF(A35 = \"\", \"\",VLOOKUP(A35,Master!$B$12:$T$78,COLUMN(Master!$K$1)-1, FALSE))","v":"Dry"},{"$f":"IF(A35 = \"\", \"\",VLOOKUP(A35,Master!$B$12:$T$78,COLUMN(Master!$S$1)-1, FALSE))","v":"For purchase"},{"$f":"IF(A35 = \"\", \"\",VLOOKUP(A35,Master!$B$12:$T$78,COLUMN(Master!$T$1)-1, FALSE))","v":"Conveyance"}]
["CalTech Toilet ",{"$f":"IF(A36 = \"\", \"\",VLOOKUP(A36,Master!$B$12:$T$78,COLUMN(Master!$L$1)-1, FALSE))","v":"Household"},{"$f":"IF(A36 = \"\", \"\",VLOOKUP(A36,Master!$B$12:$T$78,COLUMN(Master!$M$1)-1, FALSE))","v":"Container"},{"$f":"IF(A36 = \"\", \"\",VLOOKUP(A36,Master!$B$12:$T$78,COLUMN(Master!$N$1)-1, FALSE))","v":"Yes"},{"$f":"IF(A36 = \"\", \"\",VLOOKUP(A36,Master!$B$12:$T$78,COLUMN(Master!$O$1)-1, FALSE))","v":"0-9m²"},{"$f":"IF(A36 = \"\", \"\",VLOOKUP(A36,Master!$B$12:$T$78,COLUMN(Master!$P$1)-1, FALSE))","v":"NA"},{"$f":"IF(A36 = \"\", \"\",VLOOKUP(A36,Master!$B$12:$T$78,COLUMN(Master!$Q$1)-1, FALSE))","v":"Onsite"},{"$f":"IF(A36 = \"\", \"\",VLOOKUP(A36,Master!$B$12:$T$78,COLUMN(Master!$R$1)-1, FALSE))","v":"Briquettes"},{"$f":"IF(A36 = \"\", \"\",VLOOKUP(A36,Master!$B$12:$T$78,COLUMN(Master!$C$1)-1, FALSE))","v":"Sit"},{"$f":"IF(A36 = \"\", \"\",VLOOKUP(A36,Master!$B$12:$T$78,COLUMN(Master!$D$1)-1, FALSE))","v":"No"},{"$f":"IF(A36 = \"\", \"\",VLOOKUP(A36,Master!$B$12:$T$78,COLUMN(Master!$K$1)-1, FALSE))","v":"Wet"},{"$f":"IF(A36 = \"\", \"\",VLOOKUP(A36,Master!$B$12:$T$78,COLUMN(Master!$S$1)-1, FALSE))","v":"In development"},{"$f":"IF(A36 = \"\", \"\",VLOOKUP(A36,Master!$B$12:$T$78,COLUMN(Master!$T$1)-1, FALSE))","v":"Use and/or disposal"}]
["Clean Team Toilet",{"$f":"IF(A37 = \"\", \"\",VLOOKUP(A37,Master!$B$12:$T$78,COLUMN(Master!$L$1)-1, FALSE))","v":"Household"},{"$f":"IF(A37 = \"\", \"\",VLOOKUP(A37,Master!$B$12:$T$78,COLUMN(Master!$M$1)-1, FALSE))","v":"Container"},{"$f":"IF(A37 = \"\", \"\",VLOOKUP(A37,Master!$B$12:$T$78,COLUMN(Master!$N$1)-1, FALSE))","v":"Yes"},{"$f":"IF(A37 = \"\", \"\",VLOOKUP(A37,Master!$B$12:$T$78,COLUMN(Master!$O$1)-1, FALSE))","v":"0-9m²"},{"$f":"IF(A37 = \"\", \"\",VLOOKUP(A37,Master!$B$12:$T$78,COLUMN(Master!$P$1)-1, FALSE))","v":"Container"},{"$f":"IF(A37 = \"\", \"\",VLOOKUP(A37,Master!$B$12:$T$78,COLUMN(Master!$Q$1)-1, FALSE))","v":"Offsite"},{"$f":"IF(A37 = \"\", \"\",VLOOKUP(A37,Master!$B$12:$T$78,COLUMN(Master!$R$1)-1, FALSE))","v":"None"},{"$f":"IF(A37 = \"\", \"\",VLOOKUP(A37,Master!$B$12:$T$78,COLUMN(Master!$C$1)-1, FALSE))","v":"Container"},{"$f":"IF(A37 = \"\", \"\",VLOOKUP(A37,Master!$B$12:$T$78,COLUMN(Master!$D$1)-1, FALSE))","v":"Yes"},{"$f":"IF(A37 = \"\", \"\",VLOOKUP(A37,Master!$B$12:$T$78,COLUMN(Master!$K$1)-1, FALSE))","v":"Dry"},{"$f":"IF(A37 = \"\", \"\",VLOOKUP(A37,Master!$B$12:$T$78,COLUMN(Master!$S$1)-1, FALSE))","v":"For purchase"},{"$f":"IF(A37 = \"\", \"\",VLOOKUP(A37,Master!$B$12:$T$78,COLUMN(Master!$T$1)-1, FALSE))","v":"Conveyance"}]
["Crainfield Nano Membrane Toilet",{"$f":"IF(A38 = \"\", \"\",VLOOKUP(A38,Master!$B$12:$T$78,COLUMN(Master!$L$1)-1, FALSE))","v":"Household"},{"$f":"IF(A38 = \"\", \"\",VLOOKUP(A38,Master!$B$12:$T$78,COLUMN(Master!$M$1)-1, FALSE))","v":"Above ground"},{"$f":"IF(A38 = \"\", \"\",VLOOKUP(A38,Master!$B$12:$T$78,COLUMN(Master!$N$1)-1, FALSE))","v":"Yes"},{"$f":"IF(A38 = \"\", \"\",VLOOKUP(A38,Master!$B$12:$T$78,COLUMN(Master!$O$1)-1, FALSE))","v":"0-9m²"},{"$f":"IF(A38 = \"\", \"\",VLOOKUP(A38,Master!$B$12:$T$78,COLUMN(Master!$P$1)-1, FALSE))","v":"NA"},{"$f":"IF(A38 = \"\", \"\",VLOOKUP(A38,Master!$B$12:$T$78,COLUMN(Master!$Q$1)-1, FALSE))","v":"Onsite"},{"$f":"IF(A38 = \"\", \"\",VLOOKUP(A38,Master!$B$12:$T$78,COLUMN(Master!$R$1)-1, FALSE))","v":"None"},{"$f":"IF(A38 = \"\", \"\",VLOOKUP(A38,Master!$B$12:$T$78,COLUMN(Master!$C$1)-1, FALSE))","v":"Sit"},{"$f":"IF(A38 = \"\", \"\",VLOOKUP(A38,Master!$B$12:$T$78,COLUMN(Master!$D$1)-1, FALSE))","v":"Yes"},{"$f":"IF(A38 = \"\", \"\",VLOOKUP(A38,Master!$B$12:$T$78,COLUMN(Master!$K$1)-1, FALSE))","v":"Dry"},{"$f":"IF(A38 = \"\", \"\",VLOOKUP(A38,Master!$B$12:$T$78,COLUMN(Master!$S$1)-1, FALSE))","v":"In development"},{"$f":"IF(A38 = \"\", \"\",VLOOKUP(A38,Master!$B$12:$T$78,COLUMN(Master!$T$1)-1, FALSE))","v":"Use and/or disposal"}]
["Duraplast Septic Tank",{"$f":"IF(A39 = \"\", \"\",VLOOKUP(A39,Master!$B$12:$T$78,COLUMN(Master!$L$1)-1, FALSE))","v":"Household"},{"$f":"IF(A39 = \"\", \"\",VLOOKUP(A39,Master!$B$12:$T$78,COLUMN(Master!$M$1)-1, FALSE))","v":"Below ground"},{"$f":"IF(A39 = \"\", \"\",VLOOKUP(A39,Master!$B$12:$T$78,COLUMN(Master!$N$1)-1, FALSE))","v":"Yes"},{"$f":"IF(A39 = \"\", \"\",VLOOKUP(A39,Master!$B$12:$T$78,COLUMN(Master!$O$1)-1, FALSE))","v":"0-9m²"},{"$f":"IF(A39 = \"\", \"\",VLOOKUP(A39,Master!$B$12:$T$78,COLUMN(Master!$P$1)-1, FALSE))","v":"Manual/Pump"},{"$f":"IF(A39 = \"\", \"\",VLOOKUP(A39,Master!$B$12:$T$78,COLUMN(Master!$Q$1)-1, FALSE))","v":"Offsite"},{"$f":"IF(A39 = \"\", \"\",VLOOKUP(A39,Master!$B$12:$T$78,COLUMN(Master!$R$1)-1, FALSE))","v":"None"},{"$f":"IF(A39 = \"\", \"\",VLOOKUP(A39,Master!$B$12:$T$78,COLUMN(Master!$C$1)-1, FALSE))","v":"Sit/Squat"},{"$f":"IF(A39 = \"\", \"\",VLOOKUP(A39,Master!$B$12:$T$78,COLUMN(Master!$D$1)-1, FALSE))","v":"No"},{"$f":"IF(A39 = \"\", \"\",VLOOKUP(A39,Master!$B$12:$T$78,COLUMN(Master!$K$1)-1, FALSE))","v":"Wet"},{"$f":"IF(A39 = \"\", \"\",VLOOKUP(A39,Master!$B$12:$T$78,COLUMN(Master!$S$1)-1, FALSE))","v":"For purchase"},{"$f":"IF(A39 = \"\", \"\",VLOOKUP(A39,Master!$B$12:$T$78,COLUMN(Master!$T$1)-1, FALSE))","v":"Conveyance"}]
["Earth Auger",{"$f":"IF(A40 = \"\", \"\",VLOOKUP(A40,Master!$B$12:$T$78,COLUMN(Master!$L$1)-1, FALSE))","v":"Household"},{"$f":"IF(A40 = \"\", \"\",VLOOKUP(A40,Master!$B$12:$T$78,COLUMN(Master!$M$1)-1, FALSE))","v":"Above ground"},{"$f":"IF(A40 = \"\", \"\",VLOOKUP(A40,Master!$B$12:$T$78,COLUMN(Master!$N$1)-1, FALSE))","v":"Yes"},{"$f":"IF(A40 = \"\", \"\",VLOOKUP(A40,Master!$B$12:$T$78,COLUMN(Master!$O$1)-1, FALSE))","v":"0-9m²"},{"$f":"IF(A40 = \"\", \"\",VLOOKUP(A40,Master!$B$12:$T$78,COLUMN(Master!$P$1)-1, FALSE))","v":"NA"},{"$f":"IF(A40 = \"\", \"\",VLOOKUP(A40,Master!$B$12:$T$78,COLUMN(Master!$Q$1)-1, FALSE))","v":"Onsite"},{"$f":"IF(A40 = \"\", \"\",VLOOKUP(A40,Master!$B$12:$T$78,COLUMN(Master!$R$1)-1, FALSE))","v":"Compost"},{"$f":"IF(A40 = \"\", \"\",VLOOKUP(A40,Master!$B$12:$T$78,COLUMN(Master!$C$1)-1, FALSE))","v":"Sit"},{"$f":"IF(A40 = \"\", \"\",VLOOKUP(A40,Master!$B$12:$T$78,COLUMN(Master!$D$1)-1, FALSE))","v":"Yes"},{"$f":"IF(A40 = \"\", \"\",VLOOKUP(A40,Master!$B$12:$T$78,COLUMN(Master!$K$1)-1, FALSE))","v":"Dry"},{"$f":"IF(A40 = \"\", \"\",VLOOKUP(A40,Master!$B$12:$T$78,COLUMN(Master!$S$1)-1, FALSE))","v":"In development"},{"$f":"IF(A40 = \"\", \"\",VLOOKUP(A40,Master!$B$12:$T$78,COLUMN(Master!$T$1)-1, FALSE))","v":"Use and/or disposal"}]
["Easy Latrine",{"$f":"IF(A41 = \"\", \"\",VLOOKUP(A41,Master!$B$12:$T$78,COLUMN(Master!$L$1)-1, FALSE))","v":"Household"},{"$f":"IF(A41 = \"\", \"\",VLOOKUP(A41,Master!$B$12:$T$78,COLUMN(Master!$M$1)-1, FALSE))","v":"Below ground"},{"$f":"IF(A41 = \"\", \"\",VLOOKUP(A41,Master!$B$12:$T$78,COLUMN(Master!$N$1)-1, FALSE))","v":"No"},{"$f":"IF(A41 = \"\", \"\",VLOOKUP(A41,Master!$B$12:$T$78,COLUMN(Master!$O$1)-1, FALSE))","v":"9-49m²"},{"$f":"IF(A41 = \"\", \"\",VLOOKUP(A41,Master!$B$12:$T$78,COLUMN(Master!$P$1)-1, FALSE))","v":"NA"},{"$f":"IF(A41 = \"\", \"\",VLOOKUP(A41,Master!$B$12:$T$78,COLUMN(Master!$Q$1)-1, FALSE))","v":"Onsite"},{"$f":"IF(A41 = \"\", \"\",VLOOKUP(A41,Master!$B$12:$T$78,COLUMN(Master!$R$1)-1, FALSE))","v":"Compost"},{"$f":"IF(A41 = \"\", \"\",VLOOKUP(A41,Master!$B$12:$T$78,COLUMN(Master!$C$1)-1, FALSE))","v":"Squat"},{"$f":"IF(A41 = \"\", \"\",VLOOKUP(A41,Master!$B$12:$T$78,COLUMN(Master!$D$1)-1, FALSE))","v":"No"},{"$f":"IF(A41 = \"\", \"\",VLOOKUP(A41,Master!$B$12:$T$78,COLUMN(Master!$K$1)-1, FALSE))","v":"Wet"},{"$f":"IF(A41 = \"\", \"\",VLOOKUP(A41,Master!$B$12:$T$78,COLUMN(Master!$S$1)-1, FALSE))","v":"For purchase"},{"$f":"IF(A41 = \"\", \"\",VLOOKUP(A41,Master!$B$12:$T$78,COLUMN(Master!$T$1)-1, FALSE))","v":"Use and/or disposal"}]
["Ecodomeo",{"$f":"IF(A42 = \"\", \"\",VLOOKUP(A42,Master!$B$12:$T$78,COLUMN(Master!$L$1)-1, FALSE))","v":"Household"},{"$f":"IF(A42 = \"\", \"\",VLOOKUP(A42,Master!$B$12:$T$78,COLUMN(Master!$M$1)-1, FALSE))","v":"Above ground"},{"$f":"IF(A42 = \"\", \"\",VLOOKUP(A42,Master!$B$12:$T$78,COLUMN(Master!$N$1)-1, FALSE))","v":"Yes"},{"$f":"IF(A42 = \"\", \"\",VLOOKUP(A42,Master!$B$12:$T$78,COLUMN(Master!$O$1)-1, FALSE))","v":"9-49m²"},{"$f":"IF(A42 = \"\", \"\",VLOOKUP(A42,Master!$B$12:$T$78,COLUMN(Master!$P$1)-1, FALSE))","v":"NA"},{"$f":"IF(A42 = \"\", \"\",VLOOKUP(A42,Master!$B$12:$T$78,COLUMN(Master!$Q$1)-1, FALSE))","v":"Onsite"},{"$f":"IF(A42 = \"\", \"\",VLOOKUP(A42,Master!$B$12:$T$78,COLUMN(Master!$R$1)-1, FALSE))","v":"Compost"},{"$f":"IF(A42 = \"\", \"\",VLOOKUP(A42,Master!$B$12:$T$78,COLUMN(Master!$C$1)-1, FALSE))","v":"Sit/Squat"},{"$f":"IF(A42 = \"\", \"\",VLOOKUP(A42,Master!$B$12:$T$78,COLUMN(Master!$D$1)-1, FALSE))","v":"No"},{"$f":"IF(A42 = \"\", \"\",VLOOKUP(A42,Master!$B$12:$T$78,COLUMN(Master!$K$1)-1, FALSE))","v":"Dry"},{"$f":"IF(A42 = \"\", \"\",VLOOKUP(A42,Master!$B$12:$T$78,COLUMN(Master!$S$1)-1, FALSE))","v":"For purchase"},{"$f":"IF(A42 = \"\", \"\",VLOOKUP(A42,Master!$B$12:$T$78,COLUMN(Master!$T$1)-1, FALSE))","v":"Use and/or disposal"}]
["Ecological Urinal ",{"$f":"IF(A43 = \"\", \"\",VLOOKUP(A43,Master!$B$12:$T$78,COLUMN(Master!$L$1)-1, FALSE))","v":"Household"},{"$f":"IF(A43 = \"\", \"\",VLOOKUP(A43,Master!$B$12:$T$78,COLUMN(Master!$M$1)-1, FALSE))","v":"Container"},{"$f":"IF(A43 = \"\", \"\",VLOOKUP(A43,Master!$B$12:$T$78,COLUMN(Master!$N$1)-1, FALSE))","v":"Yes"},{"$f":"IF(A43 = \"\", \"\",VLOOKUP(A43,Master!$B$12:$T$78,COLUMN(Master!$O$1)-1, FALSE))","v":"0-9m²"},{"$f":"IF(A43 = \"\", \"\",VLOOKUP(A43,Master!$B$12:$T$78,COLUMN(Master!$P$1)-1, FALSE))","v":"Container"},{"$f":"IF(A43 = \"\", \"\",VLOOKUP(A43,Master!$B$12:$T$78,COLUMN(Master!$Q$1)-1, FALSE))","v":"NA"},{"$f":"IF(A43 = \"\", \"\",VLOOKUP(A43,Master!$B$12:$T$78,COLUMN(Master!$R$1)-1, FALSE))","v":"None"},{"$f":"IF(A43 = \"\", \"\",VLOOKUP(A43,Master!$B$12:$T$78,COLUMN(Master!$C$1)-1, FALSE))","v":"Container"},{"$f":"IF(A43 = \"\", \"\",VLOOKUP(A43,Master!$B$12:$T$78,COLUMN(Master!$D$1)-1, FALSE))","v":"Yes"},{"$f":"IF(A43 = \"\", \"\",VLOOKUP(A43,Master!$B$12:$T$78,COLUMN(Master!$K$1)-1, FALSE))","v":"Dry"},{"$f":"IF(A43 = \"\", \"\",VLOOKUP(A43,Master!$B$12:$T$78,COLUMN(Master!$S$1)-1, FALSE))","v":"For purchase"},{"$f":"IF(A43 = \"\", \"\",VLOOKUP(A43,Master!$B$12:$T$78,COLUMN(Master!$T$1)-1, FALSE))","v":"Conveyance"}]
["Ecosan Pit Toilets - VIP 450, VIP 200",{"$f":"IF(A44 = \"\", \"\",VLOOKUP(A44,Master!$B$12:$T$78,COLUMN(Master!$L$1)-1, FALSE))","v":"Household"},{"$f":"IF(A44 = \"\", \"\",VLOOKUP(A44,Master!$B$12:$T$78,COLUMN(Master!$M$1)-1, FALSE))","v":"Container"},{"$f":"IF(A44 = \"\", \"\",VLOOKUP(A44,Master!$B$12:$T$78,COLUMN(Master!$N$1)-1, FALSE))","v":"No"},{"$f":"IF(A44 = \"\", \"\",VLOOKUP(A44,Master!$B$12:$T$78,COLUMN(Master!$O$1)-1, FALSE))","v":"0-9m²"},{"$f":"IF(A44 = \"\", \"\",VLOOKUP(A44,Master!$B$12:$T$78,COLUMN(Master!$P$1)-1, FALSE))","v":"Manual/Pump"},{"$f":"IF(A44 = \"\", \"\",VLOOKUP(A44,Master!$B$12:$T$78,COLUMN(Master!$Q$1)-1, FALSE))","v":"Offsite"},{"$f":"IF(A44 = \"\", \"\",VLOOKUP(A44,Master!$B$12:$T$78,COLUMN(Master!$R$1)-1, FALSE))","v":"Compost"},{"$f":"IF(A44 = \"\", \"\",VLOOKUP(A44,Master!$B$12:$T$78,COLUMN(Master!$C$1)-1, FALSE))","v":"Sit"},{"$f":"IF(A44 = \"\", \"\",VLOOKUP(A44,Master!$B$12:$T$78,COLUMN(Master!$D$1)-1, FALSE))","v":"No"},{"$f":"IF(A44 = \"\", \"\",VLOOKUP(A44,Master!$B$12:$T$78,COLUMN(Master!$K$1)-1, FALSE))","v":"Dry"},{"$f":"IF(A44 = \"\", \"\",VLOOKUP(A44,Master!$B$12:$T$78,COLUMN(Master!$S$1)-1, FALSE))","v":"For purchase"},{"$f":"IF(A44 = \"\", \"\",VLOOKUP(A44,Master!$B$12:$T$78,COLUMN(Master!$T$1)-1, FALSE))","v":"Conveyance "}]
["Ecosan Waterless Toilet",{"$f":"IF(A45 = \"\", \"\",VLOOKUP(A45,Master!$B$12:$T$78,COLUMN(Master!$L$1)-1, FALSE))","v":"Household"},{"$f":"IF(A45 = \"\", \"\",VLOOKUP(A45,Master!$B$12:$T$78,COLUMN(Master!$M$1)-1, FALSE))","v":"Above ground"},{"$f":"IF(A45 = \"\", \"\",VLOOKUP(A45,Master!$B$12:$T$78,COLUMN(Master!$N$1)-1, FALSE))","v":"Yes"},{"$f":"IF(A45 = \"\", \"\",VLOOKUP(A45,Master!$B$12:$T$78,COLUMN(Master!$O$1)-1, FALSE))","v":"9-49m²"},{"$f":"IF(A45 = \"\", \"\",VLOOKUP(A45,Master!$B$12:$T$78,COLUMN(Master!$P$1)-1, FALSE))","v":"NA"},{"$f":"IF(A45 = \"\", \"\",VLOOKUP(A45,Master!$B$12:$T$78,COLUMN(Master!$Q$1)-1, FALSE))","v":"Onsite"},{"$f":"IF(A45 = \"\", \"\",VLOOKUP(A45,Master!$B$12:$T$78,COLUMN(Master!$R$1)-1, FALSE))","v":"Compost"},{"$f":"IF(A45 = \"\", \"\",VLOOKUP(A45,Master!$B$12:$T$78,COLUMN(Master!$C$1)-1, FALSE))","v":"Sit"},{"$f":"IF(A45 = \"\", \"\",VLOOKUP(A45,Master!$B$12:$T$78,COLUMN(Master!$D$1)-1, FALSE))","v":"No"},{"$f":"IF(A45 = \"\", \"\",VLOOKUP(A45,Master!$B$12:$T$78,COLUMN(Master!$K$1)-1, FALSE))","v":"Dry"},{"$f":"IF(A45 = \"\", \"\",VLOOKUP(A45,Master!$B$12:$T$78,COLUMN(Master!$S$1)-1, FALSE))","v":"For purchase"},{"$f":"IF(A45 = \"\", \"\",VLOOKUP(A45,Master!$B$12:$T$78,COLUMN(Master!$T$1)-1, FALSE))","v":"Use and/or disposal"}]
["EkoLakay Toilet",{"$f":"IF(A46 = \"\", \"\",VLOOKUP(A46,Master!$B$12:$T$78,COLUMN(Master!$L$1)-1, FALSE))","v":"Household"},{"$f":"IF(A46 = \"\", \"\",VLOOKUP(A46,Master!$B$12:$T$78,COLUMN(Master!$M$1)-1, FALSE))","v":"Container"},{"$f":"IF(A46 = \"\", \"\",VLOOKUP(A46,Master!$B$12:$T$78,COLUMN(Master!$N$1)-1, FALSE))","v":"Yes"},{"$f":"IF(A46 = \"\", \"\",VLOOKUP(A46,Master!$B$12:$T$78,COLUMN(Master!$O$1)-1, FALSE))","v":"0-9m²"},{"$f":"IF(A46 = \"\", \"\",VLOOKUP(A46,Master!$B$12:$T$78,COLUMN(Master!$P$1)-1, FALSE))","v":"Container"},{"$f":"IF(A46 = \"\", \"\",VLOOKUP(A46,Master!$B$12:$T$78,COLUMN(Master!$Q$1)-1, FALSE))","v":"Offsite"},{"$f":"IF(A46 = \"\", \"\",VLOOKUP(A46,Master!$B$12:$T$78,COLUMN(Master!$R$1)-1, FALSE))","v":"Compost"},{"$f":"IF(A46 = \"\", \"\",VLOOKUP(A46,Master!$B$12:$T$78,COLUMN(Master!$C$1)-1, FALSE))","v":"Container"},{"$f":"IF(A46 = \"\", \"\",VLOOKUP(A46,Master!$B$12:$T$78,COLUMN(Master!$D$1)-1, FALSE))","v":"Yes"},{"$f":"IF(A46 = \"\", \"\",VLOOKUP(A46,Master!$B$12:$T$78,COLUMN(Master!$K$1)-1, FALSE))","v":"Dry"},{"$f":"IF(A46 = \"\", \"\",VLOOKUP(A46,Master!$B$12:$T$78,COLUMN(Master!$S$1)-1, FALSE))","v":"For purchase"},{"$f":"IF(A46 = \"\", \"\",VLOOKUP(A46,Master!$B$12:$T$78,COLUMN(Master!$T$1)-1, FALSE))","v":"Conveyance"}]
["Enbiolet Toilet - Community",{"$f":"IF(A47 = \"\", \"\",VLOOKUP(A47,Master!$B$12:$T$78,COLUMN(Master!$L$1)-1, FALSE))","v":"Community"},{"$f":"IF(A47 = \"\", \"\",VLOOKUP(A47,Master!$B$12:$T$78,COLUMN(Master!$M$1)-1, FALSE))","v":"Above ground"},{"$f":"IF(A47 = \"\", \"\",VLOOKUP(A47,Master!$B$12:$T$78,COLUMN(Master!$N$1)-1, FALSE))","v":"Yes"},{"$f":"IF(A47 = \"\", \"\",VLOOKUP(A47,Master!$B$12:$T$78,COLUMN(Master!$O$1)-1, FALSE))","v":">49m²"},{"$f":"IF(A47 = \"\", \"\",VLOOKUP(A47,Master!$B$12:$T$78,COLUMN(Master!$P$1)-1, FALSE))","v":"NA"},{"$f":"IF(A47 = \"\", \"\",VLOOKUP(A47,Master!$B$12:$T$78,COLUMN(Master!$Q$1)-1, FALSE))","v":"Onsite"},{"$f":"IF(A47 = \"\", \"\",VLOOKUP(A47,Master!$B$12:$T$78,COLUMN(Master!$R$1)-1, FALSE))","v":"None"},{"$f":"IF(A47 = \"\", \"\",VLOOKUP(A47,Master!$B$12:$T$78,COLUMN(Master!$C$1)-1, FALSE))","v":"Sit/Squat"},{"$f":"IF(A47 = \"\", \"\",VLOOKUP(A47,Master!$B$12:$T$78,COLUMN(Master!$D$1)-1, FALSE))","v":"Yes"},{"$f":"IF(A47 = \"\", \"\",VLOOKUP(A47,Master!$B$12:$T$78,COLUMN(Master!$K$1)-1, FALSE))","v":"Wet"},{"$f":"IF(A47 = \"\", \"\",VLOOKUP(A47,Master!$B$12:$T$78,COLUMN(Master!$S$1)-1, FALSE))","v":"For purchase"},{"$f":"IF(A47 = \"\", \"\",VLOOKUP(A47,Master!$B$12:$T$78,COLUMN(Master!$T$1)-1, FALSE))","v":"Use and/or disposal"}]
["Enbiolet Toilet - Single",{"$f":"IF(A48 = \"\", \"\",VLOOKUP(A48,Master!$B$12:$T$78,COLUMN(Master!$L$1)-1, FALSE))","v":"Household"},{"$f":"IF(A48 = \"\", \"\",VLOOKUP(A48,Master!$B$12:$T$78,COLUMN(Master!$M$1)-1, FALSE))","v":"Above ground"},{"$f":"IF(A48 = \"\", \"\",VLOOKUP(A48,Master!$B$12:$T$78,COLUMN(Master!$N$1)-1, FALSE))","v":"Yes"},{"$f":"IF(A48 = \"\", \"\",VLOOKUP(A48,Master!$B$12:$T$78,COLUMN(Master!$O$1)-1, FALSE))","v":"0-9m²"},{"$f":"IF(A48 = \"\", \"\",VLOOKUP(A48,Master!$B$12:$T$78,COLUMN(Master!$P$1)-1, FALSE))","v":"NA"},{"$f":"IF(A48 = \"\", \"\",VLOOKUP(A48,Master!$B$12:$T$78,COLUMN(Master!$Q$1)-1, FALSE))","v":"Onsite"},{"$f":"IF(A48 = \"\", \"\",VLOOKUP(A48,Master!$B$12:$T$78,COLUMN(Master!$R$1)-1, FALSE))","v":"None"},{"$f":"IF(A48 = \"\", \"\",VLOOKUP(A48,Master!$B$12:$T$78,COLUMN(Master!$C$1)-1, FALSE))","v":"Sit/Squat"},{"$f":"IF(A48 = \"\", \"\",VLOOKUP(A48,Master!$B$12:$T$78,COLUMN(Master!$D$1)-1, FALSE))","v":"Yes"},{"$f":"IF(A48 = \"\", \"\",VLOOKUP(A48,Master!$B$12:$T$78,COLUMN(Master!$K$1)-1, FALSE))","v":"Wet"},{"$f":"IF(A48 = \"\", \"\",VLOOKUP(A48,Master!$B$12:$T$78,COLUMN(Master!$S$1)-1, FALSE))","v":"For purchase"},{"$f":"IF(A48 = \"\", \"\",VLOOKUP(A48,Master!$B$12:$T$78,COLUMN(Master!$T$1)-1, FALSE))","v":"Use and/or disposal"}]
["Enviro-Loo - Communal",{"$f":"IF(A49 = \"\", \"\",VLOOKUP(A49,Master!$B$12:$T$78,COLUMN(Master!$L$1)-1, FALSE))","v":"Community"},{"$f":"IF(A49 = \"\", \"\",VLOOKUP(A49,Master!$B$12:$T$78,COLUMN(Master!$M$1)-1, FALSE))","v":"Below ground"},{"$f":"IF(A49 = \"\", \"\",VLOOKUP(A49,Master!$B$12:$T$78,COLUMN(Master!$N$1)-1, FALSE))","v":"Yes"},{"$f":"IF(A49 = \"\", \"\",VLOOKUP(A49,Master!$B$12:$T$78,COLUMN(Master!$O$1)-1, FALSE))","v":"0-9m²"},{"$f":"IF(A49 = \"\", \"\",VLOOKUP(A49,Master!$B$12:$T$78,COLUMN(Master!$P$1)-1, FALSE))","v":"NA"},{"$f":"IF(A49 = \"\", \"\",VLOOKUP(A49,Master!$B$12:$T$78,COLUMN(Master!$Q$1)-1, FALSE))","v":"Onsite"},{"$f":"IF(A49 = \"\", \"\",VLOOKUP(A49,Master!$B$12:$T$78,COLUMN(Master!$R$1)-1, FALSE))","v":"Compost"},{"$f":"IF(A49 = \"\", \"\",VLOOKUP(A49,Master!$B$12:$T$78,COLUMN(Master!$C$1)-1, FALSE))","v":"Sit"},{"$f":"IF(A49 = \"\", \"\",VLOOKUP(A49,Master!$B$12:$T$78,COLUMN(Master!$D$1)-1, FALSE))","v":"Yes"},{"$f":"IF(A49 = \"\", \"\",VLOOKUP(A49,Master!$B$12:$T$78,COLUMN(Master!$K$1)-1, FALSE))","v":"Dry"},{"$f":"IF(A49 = \"\", \"\",VLOOKUP(A49,Master!$B$12:$T$78,COLUMN(Master!$S$1)-1, FALSE))","v":"For purchase"},{"$f":"IF(A49 = \"\", \"\",VLOOKUP(A49,Master!$B$12:$T$78,COLUMN(Master!$T$1)-1, FALSE))","v":"Use and/or disposal"}]
["Enviro-Loo - Domestic",{"$f":"IF(A50 = \"\", \"\",VLOOKUP(A50,Master!$B$12:$T$78,COLUMN(Master!$L$1)-1, FALSE))","v":"Household"},{"$f":"IF(A50 = \"\", \"\",VLOOKUP(A50,Master!$B$12:$T$78,COLUMN(Master!$M$1)-1, FALSE))","v":"Below ground"},{"$f":"IF(A50 = \"\", \"\",VLOOKUP(A50,Master!$B$12:$T$78,COLUMN(Master!$N$1)-1, FALSE))","v":"Yes"},{"$f":"IF(A50 = \"\", \"\",VLOOKUP(A50,Master!$B$12:$T$78,COLUMN(Master!$O$1)-1, FALSE))","v":"0-9m²"},{"$f":"IF(A50 = \"\", \"\",VLOOKUP(A50,Master!$B$12:$T$78,COLUMN(Master!$P$1)-1, FALSE))","v":"NA"},{"$f":"IF(A50 = \"\", \"\",VLOOKUP(A50,Master!$B$12:$T$78,COLUMN(Master!$Q$1)-1, FALSE))","v":"Onsite"},{"$f":"IF(A50 = \"\", \"\",VLOOKUP(A50,Master!$B$12:$T$78,COLUMN(Master!$R$1)-1, FALSE))","v":"Compost"},{"$f":"IF(A50 = \"\", \"\",VLOOKUP(A50,Master!$B$12:$T$78,COLUMN(Master!$C$1)-1, FALSE))","v":"Sit"},{"$f":"IF(A50 = \"\", \"\",VLOOKUP(A50,Master!$B$12:$T$78,COLUMN(Master!$D$1)-1, FALSE))","v":"Yes"},{"$f":"IF(A50 = \"\", \"\",VLOOKUP(A50,Master!$B$12:$T$78,COLUMN(Master!$K$1)-1, FALSE))","v":"Dry"},{"$f":"IF(A50 = \"\", \"\",VLOOKUP(A50,Master!$B$12:$T$78,COLUMN(Master!$S$1)-1, FALSE))","v":"For purchase"},{"$f":"IF(A50 = \"\", \"\",VLOOKUP(A50,Master!$B$12:$T$78,COLUMN(Master!$T$1)-1, FALSE))","v":"Use and/or disposal"}]
["Enviro-Loo - Industrial",{"$f":"IF(A51 = \"\", \"\",VLOOKUP(A51,Master!$B$12:$T$78,COLUMN(Master!$L$1)-1, FALSE))","v":"Community"},{"$f":"IF(A51 = \"\", \"\",VLOOKUP(A51,Master!$B$12:$T$78,COLUMN(Master!$M$1)-1, FALSE))","v":"Below ground"},{"$f":"IF(A51 = \"\", \"\",VLOOKUP(A51,Master!$B$12:$T$78,COLUMN(Master!$N$1)-1, FALSE))","v":"Yes"},{"$f":"IF(A51 = \"\", \"\",VLOOKUP(A51,Master!$B$12:$T$78,COLUMN(Master!$O$1)-1, FALSE))","v":"9-49m²"},{"$f":"IF(A51 = \"\", \"\",VLOOKUP(A51,Master!$B$12:$T$78,COLUMN(Master!$P$1)-1, FALSE))","v":"NA"},{"$f":"IF(A51 = \"\", \"\",VLOOKUP(A51,Master!$B$12:$T$78,COLUMN(Master!$Q$1)-1, FALSE))","v":"Onsite"},{"$f":"IF(A51 = \"\", \"\",VLOOKUP(A51,Master!$B$12:$T$78,COLUMN(Master!$R$1)-1, FALSE))","v":"Compost"},{"$f":"IF(A51 = \"\", \"\",VLOOKUP(A51,Master!$B$12:$T$78,COLUMN(Master!$C$1)-1, FALSE))","v":"Sit"},{"$f":"IF(A51 = \"\", \"\",VLOOKUP(A51,Master!$B$12:$T$78,COLUMN(Master!$D$1)-1, FALSE))","v":"Yes"},{"$f":"IF(A51 = \"\", \"\",VLOOKUP(A51,Master!$B$12:$T$78,COLUMN(Master!$K$1)-1, FALSE))","v":"Dry"},{"$f":"IF(A51 = \"\", \"\",VLOOKUP(A51,Master!$B$12:$T$78,COLUMN(Master!$S$1)-1, FALSE))","v":"For purchase"},{"$f":"IF(A51 = \"\", \"\",VLOOKUP(A51,Master!$B$12:$T$78,COLUMN(Master!$T$1)-1, FALSE))","v":"Use and/or disposal"}]
["Enviro-Loo - Urinal ",{"$f":"IF(A52 = \"\", \"\",VLOOKUP(A52,Master!$B$12:$T$78,COLUMN(Master!$L$1)-1, FALSE))","v":"Community"},{"$f":"IF(A52 = \"\", \"\",VLOOKUP(A52,Master!$B$12:$T$78,COLUMN(Master!$M$1)-1, FALSE))","v":"Below ground"},{"$f":"IF(A52 = \"\", \"\",VLOOKUP(A52,Master!$B$12:$T$78,COLUMN(Master!$N$1)-1, FALSE))","v":"Yes"},{"$f":"IF(A52 = \"\", \"\",VLOOKUP(A52,Master!$B$12:$T$78,COLUMN(Master!$O$1)-1, FALSE))","v":"0-9m²"},{"$f":"IF(A52 = \"\", \"\",VLOOKUP(A52,Master!$B$12:$T$78,COLUMN(Master!$P$1)-1, FALSE))","v":"NA"},{"$f":"IF(A52 = \"\", \"\",VLOOKUP(A52,Master!$B$12:$T$78,COLUMN(Master!$Q$1)-1, FALSE))","v":"NA"},{"$f":"IF(A52 = \"\", \"\",VLOOKUP(A52,Master!$B$12:$T$78,COLUMN(Master!$R$1)-1, FALSE))","v":"None"},{"$f":"IF(A52 = \"\", \"\",VLOOKUP(A52,Master!$B$12:$T$78,COLUMN(Master!$C$1)-1, FALSE))","v":"Sit"},{"$f":"IF(A52 = \"\", \"\",VLOOKUP(A52,Master!$B$12:$T$78,COLUMN(Master!$D$1)-1, FALSE))","v":"Yes"},{"$f":"IF(A52 = \"\", \"\",VLOOKUP(A52,Master!$B$12:$T$78,COLUMN(Master!$K$1)-1, FALSE))","v":"Dry"},{"$f":"IF(A52 = \"\", \"\",VLOOKUP(A52,Master!$B$12:$T$78,COLUMN(Master!$S$1)-1, FALSE))","v":"For purchase"},{"$f":"IF(A52 = \"\", \"\",VLOOKUP(A52,Master!$B$12:$T$78,COLUMN(Master!$T$1)-1, FALSE))","v":"Conveyance"}]
["Envirosan - Double Chamber Urine Diversion",{"$f":"IF(A53 = \"\", \"\",VLOOKUP(A53,Master!$B$12:$T$78,COLUMN(Master!$L$1)-1, FALSE))","v":"Household"},{"$f":"IF(A53 = \"\", \"\",VLOOKUP(A53,Master!$B$12:$T$78,COLUMN(Master!$M$1)-1, FALSE))","v":"Below ground"},{"$f":"IF(A53 = \"\", \"\",VLOOKUP(A53,Master!$B$12:$T$78,COLUMN(Master!$N$1)-1, FALSE))","v":"Yes"},{"$f":"IF(A53 = \"\", \"\",VLOOKUP(A53,Master!$B$12:$T$78,COLUMN(Master!$O$1)-1, FALSE))","v":"9-49m²"},{"$f":"IF(A53 = \"\", \"\",VLOOKUP(A53,Master!$B$12:$T$78,COLUMN(Master!$P$1)-1, FALSE))","v":"Manual"},{"$f":"IF(A53 = \"\", \"\",VLOOKUP(A53,Master!$B$12:$T$78,COLUMN(Master!$Q$1)-1, FALSE))","v":"Offsite"},{"$f":"IF(A53 = \"\", \"\",VLOOKUP(A53,Master!$B$12:$T$78,COLUMN(Master!$R$1)-1, FALSE))","v":"Compost"},{"$f":"IF(A53 = \"\", \"\",VLOOKUP(A53,Master!$B$12:$T$78,COLUMN(Master!$C$1)-1, FALSE))","v":"Sit"},{"$f":"IF(A53 = \"\", \"\",VLOOKUP(A53,Master!$B$12:$T$78,COLUMN(Master!$D$1)-1, FALSE))","v":"Yes"},{"$f":"IF(A53 = \"\", \"\",VLOOKUP(A53,Master!$B$12:$T$78,COLUMN(Master!$K$1)-1, FALSE))","v":"Dry"},{"$f":"IF(A53 = \"\", \"\",VLOOKUP(A53,Master!$B$12:$T$78,COLUMN(Master!$S$1)-1, FALSE))","v":"For purchase"},{"$f":"IF(A53 = \"\", \"\",VLOOKUP(A53,Master!$B$12:$T$78,COLUMN(Master!$T$1)-1, FALSE))","v":"Conveyance "}]
["Envirosan - Urine Diversion with Removable Bin",{"$f":"IF(A54 = \"\", \"\",VLOOKUP(A54,Master!$B$12:$T$78,COLUMN(Master!$L$1)-1, FALSE))","v":"Household"},{"$f":"IF(A54 = \"\", \"\",VLOOKUP(A54,Master!$B$12:$T$78,COLUMN(Master!$M$1)-1, FALSE))","v":"Above ground"},{"$f":"IF(A54 = \"\", \"\",VLOOKUP(A54,Master!$B$12:$T$78,COLUMN(Master!$N$1)-1, FALSE))","v":"Yes"},{"$f":"IF(A54 = \"\", \"\",VLOOKUP(A54,Master!$B$12:$T$78,COLUMN(Master!$O$1)-1, FALSE))","v":"0-9m²"},{"$f":"IF(A54 = \"\", \"\",VLOOKUP(A54,Master!$B$12:$T$78,COLUMN(Master!$P$1)-1, FALSE))","v":"NA"},{"$f":"IF(A54 = \"\", \"\",VLOOKUP(A54,Master!$B$12:$T$78,COLUMN(Master!$Q$1)-1, FALSE))","v":"Onsite"},{"$f":"IF(A54 = \"\", \"\",VLOOKUP(A54,Master!$B$12:$T$78,COLUMN(Master!$R$1)-1, FALSE))","v":"Compost"},{"$f":"IF(A54 = \"\", \"\",VLOOKUP(A54,Master!$B$12:$T$78,COLUMN(Master!$C$1)-1, FALSE))","v":"Sit"},{"$f":"IF(A54 = \"\", \"\",VLOOKUP(A54,Master!$B$12:$T$78,COLUMN(Master!$D$1)-1, FALSE))","v":"Yes"},{"$f":"IF(A54 = \"\", \"\",VLOOKUP(A54,Master!$B$12:$T$78,COLUMN(Master!$K$1)-1, FALSE))","v":"Dry"},{"$f":"IF(A54 = \"\", \"\",VLOOKUP(A54,Master!$B$12:$T$78,COLUMN(Master!$S$1)-1, FALSE))","v":"For purchase"},{"$f":"IF(A54 = \"\", \"\",VLOOKUP(A54,Master!$B$12:$T$78,COLUMN(Master!$T$1)-1, FALSE))","v":"Use and/or disposal"}]
["Envirosan - VIP with Toilet",{"$f":"IF(A55 = \"\", \"\",VLOOKUP(A55,Master!$B$12:$T$78,COLUMN(Master!$L$1)-1, FALSE))","v":"Household"},{"$f":"IF(A55 = \"\", \"\",VLOOKUP(A55,Master!$B$12:$T$78,COLUMN(Master!$M$1)-1, FALSE))","v":"Below ground"},{"$f":"IF(A55 = \"\", \"\",VLOOKUP(A55,Master!$B$12:$T$78,COLUMN(Master!$N$1)-1, FALSE))","v":"No"},{"$f":"IF(A55 = \"\", \"\",VLOOKUP(A55,Master!$B$12:$T$78,COLUMN(Master!$O$1)-1, FALSE))","v":"0-9m²"},{"$f":"IF(A55 = \"\", \"\",VLOOKUP(A55,Master!$B$12:$T$78,COLUMN(Master!$P$1)-1, FALSE))","v":"Manual/Pump"},{"$f":"IF(A55 = \"\", \"\",VLOOKUP(A55,Master!$B$12:$T$78,COLUMN(Master!$Q$1)-1, FALSE))","v":"Offsite"},{"$f":"IF(A55 = \"\", \"\",VLOOKUP(A55,Master!$B$12:$T$78,COLUMN(Master!$R$1)-1, FALSE))","v":"Compost"},{"$f":"IF(A55 = \"\", \"\",VLOOKUP(A55,Master!$B$12:$T$78,COLUMN(Master!$C$1)-1, FALSE))","v":"Sit"},{"$f":"IF(A55 = \"\", \"\",VLOOKUP(A55,Master!$B$12:$T$78,COLUMN(Master!$D$1)-1, FALSE))","v":"Yes"},{"$f":"IF(A55 = \"\", \"\",VLOOKUP(A55,Master!$B$12:$T$78,COLUMN(Master!$K$1)-1, FALSE))","v":"Dry"},{"$f":"IF(A55 = \"\", \"\",VLOOKUP(A55,Master!$B$12:$T$78,COLUMN(Master!$S$1)-1, FALSE))","v":"For purchase"},{"$f":"IF(A55 = \"\", \"\",VLOOKUP(A55,Master!$B$12:$T$78,COLUMN(Master!$T$1)-1, FALSE))","v":"Conveyance"}]
["Envirosan - VIP with Urine Diversion",{"$f":"IF(A56 = \"\", \"\",VLOOKUP(A56,Master!$B$12:$T$78,COLUMN(Master!$L$1)-1, FALSE))","v":"Household"},{"$f":"IF(A56 = \"\", \"\",VLOOKUP(A56,Master!$B$12:$T$78,COLUMN(Master!$M$1)-1, FALSE))","v":"Below ground"},{"$f":"IF(A56 = \"\", \"\",VLOOKUP(A56,Master!$B$12:$T$78,COLUMN(Master!$N$1)-1, FALSE))","v":"Yes"},{"$f":"IF(A56 = \"\", \"\",VLOOKUP(A56,Master!$B$12:$T$78,COLUMN(Master!$O$1)-1, FALSE))","v":"0-9m²"},{"$f":"IF(A56 = \"\", \"\",VLOOKUP(A56,Master!$B$12:$T$78,COLUMN(Master!$P$1)-1, FALSE))","v":"Manual/Pump"},{"$f":"IF(A56 = \"\", \"\",VLOOKUP(A56,Master!$B$12:$T$78,COLUMN(Master!$Q$1)-1, FALSE))","v":"Offsite"},{"$f":"IF(A56 = \"\", \"\",VLOOKUP(A56,Master!$B$12:$T$78,COLUMN(Master!$R$1)-1, FALSE))","v":"Compost"},{"$f":"IF(A56 = \"\", \"\",VLOOKUP(A56,Master!$B$12:$T$78,COLUMN(Master!$C$1)-1, FALSE))","v":"Sit"},{"$f":"IF(A56 = \"\", \"\",VLOOKUP(A56,Master!$B$12:$T$78,COLUMN(Master!$D$1)-1, FALSE))","v":"Yes"},{"$f":"IF(A56 = \"\", \"\",VLOOKUP(A56,Master!$B$12:$T$78,COLUMN(Master!$K$1)-1, FALSE))","v":"Dry"},{"$f":"IF(A56 = \"\", \"\",VLOOKUP(A56,Master!$B$12:$T$78,COLUMN(Master!$S$1)-1, FALSE))","v":"For purchase"},{"$f":"IF(A56 = \"\", \"\",VLOOKUP(A56,Master!$B$12:$T$78,COLUMN(Master!$T$1)-1, FALSE))","v":"Conveyance "}]
["Eram Delight",{"$f":"IF(A57 = \"\", \"\",VLOOKUP(A57,Master!$B$12:$T$78,COLUMN(Master!$L$1)-1, FALSE))","v":"Community"},{"$f":"IF(A57 = \"\", \"\",VLOOKUP(A57,Master!$B$12:$T$78,COLUMN(Master!$M$1)-1, FALSE))","v":"Above ground"},{"$f":"IF(A57 = \"\", \"\",VLOOKUP(A57,Master!$B$12:$T$78,COLUMN(Master!$N$1)-1, FALSE))","v":"Yes"},{"$f":"IF(A57 = \"\", \"\",VLOOKUP(A57,Master!$B$12:$T$78,COLUMN(Master!$O$1)-1, FALSE))","v":">49m²"},{"$f":"IF(A57 = \"\", \"\",VLOOKUP(A57,Master!$B$12:$T$78,COLUMN(Master!$P$1)-1, FALSE))","v":"NA"},{"$f":"IF(A57 = \"\", \"\",VLOOKUP(A57,Master!$B$12:$T$78,COLUMN(Master!$Q$1)-1, FALSE))","v":"Onsite"},{"$f":"IF(A57 = \"\", \"\",VLOOKUP(A57,Master!$B$12:$T$78,COLUMN(Master!$R$1)-1, FALSE))","v":"None"},{"$f":"IF(A57 = \"\", \"\",VLOOKUP(A57,Master!$B$12:$T$78,COLUMN(Master!$C$1)-1, FALSE))","v":"Sit"},{"$f":"IF(A57 = \"\", \"\",VLOOKUP(A57,Master!$B$12:$T$78,COLUMN(Master!$D$1)-1, FALSE))","v":"Yes"},{"$f":"IF(A57 = \"\", \"\",VLOOKUP(A57,Master!$B$12:$T$78,COLUMN(Master!$K$1)-1, FALSE))","v":"Wet"},{"$f":"IF(A57 = \"\", \"\",VLOOKUP(A57,Master!$B$12:$T$78,COLUMN(Master!$S$1)-1, FALSE))","v":"For purchase"},{"$f":"IF(A57 = \"\", \"\",VLOOKUP(A57,Master!$B$12:$T$78,COLUMN(Master!$T$1)-1, FALSE))","v":"Use and/or disposal"}]
["Flexi Biogas Systems Model BG5",{"$f":"IF(A58 = \"\", \"\",VLOOKUP(A58,Master!$B$12:$T$78,COLUMN(Master!$L$1)-1, FALSE))","v":"Household"},{"$f":"IF(A58 = \"\", \"\",VLOOKUP(A58,Master!$B$12:$T$78,COLUMN(Master!$M$1)-1, FALSE))","v":"Above ground"},{"$f":"IF(A58 = \"\", \"\",VLOOKUP(A58,Master!$B$12:$T$78,COLUMN(Master!$N$1)-1, FALSE))","v":"Yes"},{"$f":"IF(A58 = \"\", \"\",VLOOKUP(A58,Master!$B$12:$T$78,COLUMN(Master!$O$1)-1, FALSE))","v":"9-49m²"},{"$f":"IF(A58 = \"\", \"\",VLOOKUP(A58,Master!$B$12:$T$78,COLUMN(Master!$P$1)-1, FALSE))","v":"Manual/Pump"},{"$f":"IF(A58 = \"\", \"\",VLOOKUP(A58,Master!$B$12:$T$78,COLUMN(Master!$Q$1)-1, FALSE))","v":"Onsite"},{"$f":"IF(A58 = \"\", \"\",VLOOKUP(A58,Master!$B$12:$T$78,COLUMN(Master!$R$1)-1, FALSE))","v":"Biogas"},{"$f":"IF(A58 = \"\", \"\",VLOOKUP(A58,Master!$B$12:$T$78,COLUMN(Master!$C$1)-1, FALSE))","v":"Sit/Squat"},{"$f":"IF(A58 = \"\", \"\",VLOOKUP(A58,Master!$B$12:$T$78,COLUMN(Master!$D$1)-1, FALSE))","v":"No"},{"$f":"IF(A58 = \"\", \"\",VLOOKUP(A58,Master!$B$12:$T$78,COLUMN(Master!$K$1)-1, FALSE))","v":"Wet"},{"$f":"IF(A58 = \"\", \"\",VLOOKUP(A58,Master!$B$12:$T$78,COLUMN(Master!$S$1)-1, FALSE))","v":"For purchase"},{"$f":"IF(A58 = \"\", \"\",VLOOKUP(A58,Master!$B$12:$T$78,COLUMN(Master!$T$1)-1, FALSE))","v":"Use and/or disposal"}]
["Flexi Biogas Systems Model BG6",{"$f":"IF(A59 = \"\", \"\",VLOOKUP(A59,Master!$B$12:$T$78,COLUMN(Master!$L$1)-1, FALSE))","v":"Household"},{"$f":"IF(A59 = \"\", \"\",VLOOKUP(A59,Master!$B$12:$T$78,COLUMN(Master!$M$1)-1, FALSE))","v":"Above ground"},{"$f":"IF(A59 = \"\", \"\",VLOOKUP(A59,Master!$B$12:$T$78,COLUMN(Master!$N$1)-1, FALSE))","v":"Yes"},{"$f":"IF(A59 = \"\", \"\",VLOOKUP(A59,Master!$B$12:$T$78,COLUMN(Master!$O$1)-1, FALSE))","v":"9-49m²"},{"$f":"IF(A59 = \"\", \"\",VLOOKUP(A59,Master!$B$12:$T$78,COLUMN(Master!$P$1)-1, FALSE))","v":"Manual/Pump"},{"$f":"IF(A59 = \"\", \"\",VLOOKUP(A59,Master!$B$12:$T$78,COLUMN(Master!$Q$1)-1, FALSE))","v":"Onsite"},{"$f":"IF(A59 = \"\", \"\",VLOOKUP(A59,Master!$B$12:$T$78,COLUMN(Master!$R$1)-1, FALSE))","v":"Biogas"},{"$f":"IF(A59 = \"\", \"\",VLOOKUP(A59,Master!$B$12:$T$78,COLUMN(Master!$C$1)-1, FALSE))","v":"Sit/Squat"},{"$f":"IF(A59 = \"\", \"\",VLOOKUP(A59,Master!$B$12:$T$78,COLUMN(Master!$D$1)-1, FALSE))","v":"No"},{"$f":"IF(A59 = \"\", \"\",VLOOKUP(A59,Master!$B$12:$T$78,COLUMN(Master!$K$1)-1, FALSE))","v":"Wet"},{"$f":"IF(A59 = \"\", \"\",VLOOKUP(A59,Master!$B$12:$T$78,COLUMN(Master!$S$1)-1, FALSE))","v":"For purchase"},{"$f":"IF(A59 = \"\", \"\",VLOOKUP(A59,Master!$B$12:$T$78,COLUMN(Master!$T$1)-1, FALSE))","v":"Use and/or disposal"}]
["Flexi Biogas Systems Model DBG",{"$f":"IF(A60 = \"\", \"\",VLOOKUP(A60,Master!$B$12:$T$78,COLUMN(Master!$L$1)-1, FALSE))","v":"Community"},{"$f":"IF(A60 = \"\", \"\",VLOOKUP(A60,Master!$B$12:$T$78,COLUMN(Master!$M$1)-1, FALSE))","v":"Above ground"},{"$f":"IF(A60 = \"\", \"\",VLOOKUP(A60,Master!$B$12:$T$78,COLUMN(Master!$N$1)-1, FALSE))","v":"Yes"},{"$f":"IF(A60 = \"\", \"\",VLOOKUP(A60,Master!$B$12:$T$78,COLUMN(Master!$O$1)-1, FALSE))","v":"9-49m²"},{"$f":"IF(A60 = \"\", \"\",VLOOKUP(A60,Master!$B$12:$T$78,COLUMN(Master!$P$1)-1, FALSE))","v":"Manual/Pump"},{"$f":"IF(A60 = \"\", \"\",VLOOKUP(A60,Master!$B$12:$T$78,COLUMN(Master!$Q$1)-1, FALSE))","v":"Offsite"},{"$f":"IF(A60 = \"\", \"\",VLOOKUP(A60,Master!$B$12:$T$78,COLUMN(Master!$R$1)-1, FALSE))","v":"Biogas"},{"$f":"IF(A60 = \"\", \"\",VLOOKUP(A60,Master!$B$12:$T$78,COLUMN(Master!$C$1)-1, FALSE))","v":"Sit/Squat"},{"$f":"IF(A60 = \"\", \"\",VLOOKUP(A60,Master!$B$12:$T$78,COLUMN(Master!$D$1)-1, FALSE))","v":"No"},{"$f":"IF(A60 = \"\", \"\",VLOOKUP(A60,Master!$B$12:$T$78,COLUMN(Master!$K$1)-1, FALSE))","v":"Wet"},{"$f":"IF(A60 = \"\", \"\",VLOOKUP(A60,Master!$B$12:$T$78,COLUMN(Master!$S$1)-1, FALSE))","v":"For purchase"},{"$f":"IF(A60 = \"\", \"\",VLOOKUP(A60,Master!$B$12:$T$78,COLUMN(Master!$T$1)-1, FALSE))","v":"Use and/or disposal"}]
["Flexigester SIB Kit",{"$f":"IF(A61 = \"\", \"\",VLOOKUP(A61,Master!$B$12:$T$78,COLUMN(Master!$L$1)-1, FALSE))","v":"Community"},{"$f":"IF(A61 = \"\", \"\",VLOOKUP(A61,Master!$B$12:$T$78,COLUMN(Master!$M$1)-1, FALSE))","v":"Below ground"},{"$f":"IF(A61 = \"\", \"\",VLOOKUP(A61,Master!$B$12:$T$78,COLUMN(Master!$N$1)-1, FALSE))","v":"Yes"},{"$f":"IF(A61 = \"\", \"\",VLOOKUP(A61,Master!$B$12:$T$78,COLUMN(Master!$O$1)-1, FALSE))","v":">49m²"},{"$f":"IF(A61 = \"\", \"\",VLOOKUP(A61,Master!$B$12:$T$78,COLUMN(Master!$P$1)-1, FALSE))","v":"Manual/Pump"},{"$f":"IF(A61 = \"\", \"\",VLOOKUP(A61,Master!$B$12:$T$78,COLUMN(Master!$Q$1)-1, FALSE))","v":"Offsite"},{"$f":"IF(A61 = \"\", \"\",VLOOKUP(A61,Master!$B$12:$T$78,COLUMN(Master!$R$1)-1, FALSE))","v":"Biogas"},{"$f":"IF(A61 = \"\", \"\",VLOOKUP(A61,Master!$B$12:$T$78,COLUMN(Master!$C$1)-1, FALSE))","v":"Sit/Squat"},{"$f":"IF(A61 = \"\", \"\",VLOOKUP(A61,Master!$B$12:$T$78,COLUMN(Master!$D$1)-1, FALSE))","v":"No"},{"$f":"IF(A61 = \"\", \"\",VLOOKUP(A61,Master!$B$12:$T$78,COLUMN(Master!$K$1)-1, FALSE))","v":"Wet"},{"$f":"IF(A61 = \"\", \"\",VLOOKUP(A61,Master!$B$12:$T$78,COLUMN(Master!$S$1)-1, FALSE))","v":"For purchase"},{"$f":"IF(A61 = \"\", \"\",VLOOKUP(A61,Master!$B$12:$T$78,COLUMN(Master!$T$1)-1, FALSE))","v":"Conveyance"}]
["Flexigester V10 Kit",{"$f":"IF(A62 = \"\", \"\",VLOOKUP(A62,Master!$B$12:$T$78,COLUMN(Master!$L$1)-1, FALSE))","v":"Community"},{"$f":"IF(A62 = \"\", \"\",VLOOKUP(A62,Master!$B$12:$T$78,COLUMN(Master!$M$1)-1, FALSE))","v":"Below ground"},{"$f":"IF(A62 = \"\", \"\",VLOOKUP(A62,Master!$B$12:$T$78,COLUMN(Master!$N$1)-1, FALSE))","v":"Yes"},{"$f":"IF(A62 = \"\", \"\",VLOOKUP(A62,Master!$B$12:$T$78,COLUMN(Master!$O$1)-1, FALSE))","v":">49m²"},{"$f":"IF(A62 = \"\", \"\",VLOOKUP(A62,Master!$B$12:$T$78,COLUMN(Master!$P$1)-1, FALSE))","v":"Manual/Pump"},{"$f":"IF(A62 = \"\", \"\",VLOOKUP(A62,Master!$B$12:$T$78,COLUMN(Master!$Q$1)-1, FALSE))","v":"Offsite"},{"$f":"IF(A62 = \"\", \"\",VLOOKUP(A62,Master!$B$12:$T$78,COLUMN(Master!$R$1)-1, FALSE))","v":"Biogas"},{"$f":"IF(A62 = \"\", \"\",VLOOKUP(A62,Master!$B$12:$T$78,COLUMN(Master!$C$1)-1, FALSE))","v":"Sit/Squat"},{"$f":"IF(A62 = \"\", \"\",VLOOKUP(A62,Master!$B$12:$T$78,COLUMN(Master!$D$1)-1, FALSE))","v":"No"},{"$f":"IF(A62 = \"\", \"\",VLOOKUP(A62,Master!$B$12:$T$78,COLUMN(Master!$K$1)-1, FALSE))","v":"Wet"},{"$f":"IF(A62 = \"\", \"\",VLOOKUP(A62,Master!$B$12:$T$78,COLUMN(Master!$S$1)-1, FALSE))","v":"For purchase"},{"$f":"IF(A62 = \"\", \"\",VLOOKUP(A62,Master!$B$12:$T$78,COLUMN(Master!$T$1)-1, FALSE))","v":"Use and/or disposal"}]
["Fossa Alterna (double pit latrine)",{"$f":"IF(A63 = \"\", \"\",VLOOKUP(A63,Master!$B$12:$T$78,COLUMN(Master!$L$1)-1, FALSE))","v":"Household"},{"$f":"IF(A63 = \"\", \"\",VLOOKUP(A63,Master!$B$12:$T$78,COLUMN(Master!$M$1)-1, FALSE))","v":"Below ground"},{"$f":"IF(A63 = \"\", \"\",VLOOKUP(A63,Master!$B$12:$T$78,COLUMN(Master!$N$1)-1, FALSE))","v":"No"},{"$f":"IF(A63 = \"\", \"\",VLOOKUP(A63,Master!$B$12:$T$78,COLUMN(Master!$O$1)-1, FALSE))","v":"9-49m²"},{"$f":"IF(A63 = \"\", \"\",VLOOKUP(A63,Master!$B$12:$T$78,COLUMN(Master!$P$1)-1, FALSE))","v":"NA"},{"$f":"IF(A63 = \"\", \"\",VLOOKUP(A63,Master!$B$12:$T$78,COLUMN(Master!$Q$1)-1, FALSE))","v":"Onsite"},{"$f":"IF(A63 = \"\", \"\",VLOOKUP(A63,Master!$B$12:$T$78,COLUMN(Master!$R$1)-1, FALSE))","v":"Compost"},{"$f":"IF(A63 = \"\", \"\",VLOOKUP(A63,Master!$B$12:$T$78,COLUMN(Master!$C$1)-1, FALSE))","v":"Sit/Squat"},{"$f":"IF(A63 = \"\", \"\",VLOOKUP(A63,Master!$B$12:$T$78,COLUMN(Master!$D$1)-1, FALSE))","v":"No"},{"$f":"IF(A63 = \"\", \"\",VLOOKUP(A63,Master!$B$12:$T$78,COLUMN(Master!$K$1)-1, FALSE))","v":"Dry"},{"$f":"IF(A63 = \"\", \"\",VLOOKUP(A63,Master!$B$12:$T$78,COLUMN(Master!$S$1)-1, FALSE))","v":"Open source"},{"$f":"IF(A63 = \"\", \"\",VLOOKUP(A63,Master!$B$12:$T$78,COLUMN(Master!$T$1)-1, FALSE))","v":"Use and/or disposal"}]
["GesiShamba",{"$f":"IF(A64 = \"\", \"\",VLOOKUP(A64,Master!$B$12:$T$78,COLUMN(Master!$L$1)-1, FALSE))","v":"Household"},{"$f":"IF(A64 = \"\", \"\",VLOOKUP(A64,Master!$B$12:$T$78,COLUMN(Master!$M$1)-1, FALSE))","v":"Above ground"},{"$f":"IF(A64 = \"\", \"\",VLOOKUP(A64,Master!$B$12:$T$78,COLUMN(Master!$N$1)-1, FALSE))","v":"Yes"},{"$f":"IF(A64 = \"\", \"\",VLOOKUP(A64,Master!$B$12:$T$78,COLUMN(Master!$O$1)-1, FALSE))","v":"9-49m²"},{"$f":"IF(A64 = \"\", \"\",VLOOKUP(A64,Master!$B$12:$T$78,COLUMN(Master!$P$1)-1, FALSE))","v":"NA"},{"$f":"IF(A64 = \"\", \"\",VLOOKUP(A64,Master!$B$12:$T$78,COLUMN(Master!$Q$1)-1, FALSE))","v":"Onsite"},{"$f":"IF(A64 = \"\", \"\",VLOOKUP(A64,Master!$B$12:$T$78,COLUMN(Master!$R$1)-1, FALSE))","v":"Biogas"},{"$f":"IF(A64 = \"\", \"\",VLOOKUP(A64,Master!$B$12:$T$78,COLUMN(Master!$C$1)-1, FALSE))","v":"Sit/Squat"},{"$f":"IF(A64 = \"\", \"\",VLOOKUP(A64,Master!$B$12:$T$78,COLUMN(Master!$D$1)-1, FALSE))","v":"No"},{"$f":"IF(A64 = \"\", \"\",VLOOKUP(A64,Master!$B$12:$T$78,COLUMN(Master!$K$1)-1, FALSE))","v":"Wet"},{"$f":"IF(A64 = \"\", \"\",VLOOKUP(A64,Master!$B$12:$T$78,COLUMN(Master!$S$1)-1, FALSE))","v":"For purchase"},{"$f":"IF(A64 = \"\", \"\",VLOOKUP(A64,Master!$B$12:$T$78,COLUMN(Master!$T$1)-1, FALSE))","v":"Use and/or disposal"}]
["Ghana Sustainable Aid Project Microflush Toilets",{"$f":"IF(A65 = \"\", \"\",VLOOKUP(A65,Master!$B$12:$T$78,COLUMN(Master!$L$1)-1, FALSE))","v":"Household"},{"$f":"IF(A65 = \"\", \"\",VLOOKUP(A65,Master!$B$12:$T$78,COLUMN(Master!$M$1)-1, FALSE))","v":"Below ground"},{"$f":"IF(A65 = \"\", \"\",VLOOKUP(A65,Master!$B$12:$T$78,COLUMN(Master!$N$1)-1, FALSE))","v":"No"},{"$f":"IF(A65 = \"\", \"\",VLOOKUP(A65,Master!$B$12:$T$78,COLUMN(Master!$O$1)-1, FALSE))","v":"9-49m²"},{"$f":"IF(A65 = \"\", \"\",VLOOKUP(A65,Master!$B$12:$T$78,COLUMN(Master!$P$1)-1, FALSE))","v":"NA"},{"$f":"IF(A65 = \"\", \"\",VLOOKUP(A65,Master!$B$12:$T$78,COLUMN(Master!$Q$1)-1, FALSE))","v":"Onsite"},{"$f":"IF(A65 = \"\", \"\",VLOOKUP(A65,Master!$B$12:$T$78,COLUMN(Master!$R$1)-1, FALSE))","v":"Compost"},{"$f":"IF(A65 = \"\", \"\",VLOOKUP(A65,Master!$B$12:$T$78,COLUMN(Master!$C$1)-1, FALSE))","v":"Sit/Squat"},{"$f":"IF(A65 = \"\", \"\",VLOOKUP(A65,Master!$B$12:$T$78,COLUMN(Master!$D$1)-1, FALSE))","v":"Yes"},{"$f":"IF(A65 = \"\", \"\",VLOOKUP(A65,Master!$B$12:$T$78,COLUMN(Master!$K$1)-1, FALSE))","v":"Dry"},{"$f":"IF(A65 = \"\", \"\",VLOOKUP(A65,Master!$B$12:$T$78,COLUMN(Master!$S$1)-1, FALSE))","v":"For purchase"},{"$f":"IF(A65 = \"\", \"\",VLOOKUP(A65,Master!$B$12:$T$78,COLUMN(Master!$T$1)-1, FALSE))","v":"Use and/or disposal"}]
["Green, Portable Toilet",{"$f":"IF(A66 = \"\", \"\",VLOOKUP(A66,Master!$B$12:$T$78,COLUMN(Master!$L$1)-1, FALSE))","v":"Community"},{"$f":"IF(A66 = \"\", \"\",VLOOKUP(A66,Master!$B$12:$T$78,COLUMN(Master!$M$1)-1, FALSE))","v":"Container"},{"$f":"IF(A66 = \"\", \"\",VLOOKUP(A66,Master!$B$12:$T$78,COLUMN(Master!$N$1)-1, FALSE))","v":"Yes"},{"$f":"IF(A66 = \"\", \"\",VLOOKUP(A66,Master!$B$12:$T$78,COLUMN(Master!$O$1)-1, FALSE))","v":"9-49m²"},{"$f":"IF(A66 = \"\", \"\",VLOOKUP(A66,Master!$B$12:$T$78,COLUMN(Master!$P$1)-1, FALSE))","v":"Container"},{"$f":"IF(A66 = \"\", \"\",VLOOKUP(A66,Master!$B$12:$T$78,COLUMN(Master!$Q$1)-1, FALSE))","v":"Offsite"},{"$f":"IF(A66 = \"\", \"\",VLOOKUP(A66,Master!$B$12:$T$78,COLUMN(Master!$R$1)-1, FALSE))","v":"Compost"},{"$f":"IF(A66 = \"\", \"\",VLOOKUP(A66,Master!$B$12:$T$78,COLUMN(Master!$C$1)-1, FALSE))","v":"Container"},{"$f":"IF(A66 = \"\", \"\",VLOOKUP(A66,Master!$B$12:$T$78,COLUMN(Master!$D$1)-1, FALSE))","v":"No"},{"$f":"IF(A66 = \"\", \"\",VLOOKUP(A66,Master!$B$12:$T$78,COLUMN(Master!$K$1)-1, FALSE))","v":"Dry"},{"$f":"IF(A66 = \"\", \"\",VLOOKUP(A66,Master!$B$12:$T$78,COLUMN(Master!$S$1)-1, FALSE))","v":"In development"},{"$f":"IF(A66 = \"\", \"\",VLOOKUP(A66,Master!$B$12:$T$78,COLUMN(Master!$T$1)-1, FALSE))","v":"Conveyance"}]
["Loolaboo",{"$f":"IF(A67 = \"\", \"\",VLOOKUP(A67,Master!$B$12:$T$78,COLUMN(Master!$L$1)-1, FALSE))","v":"Household"},{"$f":"IF(A67 = \"\", \"\",VLOOKUP(A67,Master!$B$12:$T$78,COLUMN(Master!$M$1)-1, FALSE))","v":"Container"},{"$f":"IF(A67 = \"\", \"\",VLOOKUP(A67,Master!$B$12:$T$78,COLUMN(Master!$N$1)-1, FALSE))","v":"Yes"},{"$f":"IF(A67 = \"\", \"\",VLOOKUP(A67,Master!$B$12:$T$78,COLUMN(Master!$O$1)-1, FALSE))","v":"9-49m²"},{"$f":"IF(A67 = \"\", \"\",VLOOKUP(A67,Master!$B$12:$T$78,COLUMN(Master!$P$1)-1, FALSE))","v":"Container"},{"$f":"IF(A67 = \"\", \"\",VLOOKUP(A67,Master!$B$12:$T$78,COLUMN(Master!$Q$1)-1, FALSE))","v":"Offsite"},{"$f":"IF(A67 = \"\", \"\",VLOOKUP(A67,Master!$B$12:$T$78,COLUMN(Master!$R$1)-1, FALSE))","v":"Compost"},{"$f":"IF(A67 = \"\", \"\",VLOOKUP(A67,Master!$B$12:$T$78,COLUMN(Master!$C$1)-1, FALSE))","v":"Container"},{"$f":"IF(A67 = \"\", \"\",VLOOKUP(A67,Master!$B$12:$T$78,COLUMN(Master!$D$1)-1, FALSE))","v":"No"},{"$f":"IF(A67 = \"\", \"\",VLOOKUP(A67,Master!$B$12:$T$78,COLUMN(Master!$K$1)-1, FALSE))","v":"Wet"},{"$f":"IF(A67 = \"\", \"\",VLOOKUP(A67,Master!$B$12:$T$78,COLUMN(Master!$S$1)-1, FALSE))","v":"For purchase"},{"$f":"IF(A67 = \"\", \"\",VLOOKUP(A67,Master!$B$12:$T$78,COLUMN(Master!$T$1)-1, FALSE))","v":"Conveyance"}]
["Loowatt",{"$f":"IF(A68 = \"\", \"\",VLOOKUP(A68,Master!$B$12:$T$78,COLUMN(Master!$L$1)-1, FALSE))","v":"Either"},{"$f":"IF(A68 = \"\", \"\",VLOOKUP(A68,Master!$B$12:$T$78,COLUMN(Master!$M$1)-1, FALSE))","v":"Container"},{"$f":"IF(A68 = \"\", \"\",VLOOKUP(A68,Master!$B$12:$T$78,COLUMN(Master!$N$1)-1, FALSE))","v":"Yes"},{"$f":"IF(A68 = \"\", \"\",VLOOKUP(A68,Master!$B$12:$T$78,COLUMN(Master!$O$1)-1, FALSE))","v":"0-9m²"},{"$f":"IF(A68 = \"\", \"\",VLOOKUP(A68,Master!$B$12:$T$78,COLUMN(Master!$P$1)-1, FALSE))","v":"Container"},{"$f":"IF(A68 = \"\", \"\",VLOOKUP(A68,Master!$B$12:$T$78,COLUMN(Master!$Q$1)-1, FALSE))","v":"Offsite"},{"$f":"IF(A68 = \"\", \"\",VLOOKUP(A68,Master!$B$12:$T$78,COLUMN(Master!$R$1)-1, FALSE))","v":"Biogas"},{"$f":"IF(A68 = \"\", \"\",VLOOKUP(A68,Master!$B$12:$T$78,COLUMN(Master!$C$1)-1, FALSE))","v":"Container"},{"$f":"IF(A68 = \"\", \"\",VLOOKUP(A68,Master!$B$12:$T$78,COLUMN(Master!$D$1)-1, FALSE))","v":"No"},{"$f":"IF(A68 = \"\", \"\",VLOOKUP(A68,Master!$B$12:$T$78,COLUMN(Master!$K$1)-1, FALSE))","v":"Dry"},{"$f":"IF(A68 = \"\", \"\",VLOOKUP(A68,Master!$B$12:$T$78,COLUMN(Master!$S$1)-1, FALSE))","v":"For purchase"},{"$f":"IF(A68 = \"\", \"\",VLOOKUP(A68,Master!$B$12:$T$78,COLUMN(Master!$T$1)-1, FALSE))","v":"Conveyance"}]
["Loughborough Universities Toilet",{"$f":"IF(A69 = \"\", \"\",VLOOKUP(A69,Master!$B$12:$T$78,COLUMN(Master!$L$1)-1, FALSE))","v":"Household"},{"$f":"IF(A69 = \"\", \"\",VLOOKUP(A69,Master!$B$12:$T$78,COLUMN(Master!$M$1)-1, FALSE))","v":"Container"},{"$f":"IF(A69 = \"\", \"\",VLOOKUP(A69,Master!$B$12:$T$78,COLUMN(Master!$N$1)-1, FALSE))","v":"Yes"},{"$f":"IF(A69 = \"\", \"\",VLOOKUP(A69,Master!$B$12:$T$78,COLUMN(Master!$O$1)-1, FALSE))","v":"0-9m²"},{"$f":"IF(A69 = \"\", \"\",VLOOKUP(A69,Master!$B$12:$T$78,COLUMN(Master!$P$1)-1, FALSE))","v":"NA"},{"$f":"IF(A69 = \"\", \"\",VLOOKUP(A69,Master!$B$12:$T$78,COLUMN(Master!$Q$1)-1, FALSE))","v":"Onsite"},{"$f":"IF(A69 = \"\", \"\",VLOOKUP(A69,Master!$B$12:$T$78,COLUMN(Master!$R$1)-1, FALSE))","v":"Briquettes"},{"$f":"IF(A69 = \"\", \"\",VLOOKUP(A69,Master!$B$12:$T$78,COLUMN(Master!$C$1)-1, FALSE))","v":"Sit"},{"$f":"IF(A69 = \"\", \"\",VLOOKUP(A69,Master!$B$12:$T$78,COLUMN(Master!$D$1)-1, FALSE))","v":"No"},{"$f":"IF(A69 = \"\", \"\",VLOOKUP(A69,Master!$B$12:$T$78,COLUMN(Master!$K$1)-1, FALSE))","v":"Dry"},{"$f":"IF(A69 = \"\", \"\",VLOOKUP(A69,Master!$B$12:$T$78,COLUMN(Master!$S$1)-1, FALSE))","v":"In development"},{"$f":"IF(A69 = \"\", \"\",VLOOKUP(A69,Master!$B$12:$T$78,COLUMN(Master!$T$1)-1, FALSE))","v":"Use and/or disposal"}]
["Lovable Loo",{"$f":"IF(A70 = \"\", \"\",VLOOKUP(A70,Master!$B$12:$T$78,COLUMN(Master!$L$1)-1, FALSE))","v":"Household"},{"$f":"IF(A70 = \"\", \"\",VLOOKUP(A70,Master!$B$12:$T$78,COLUMN(Master!$M$1)-1, FALSE))","v":"Container"},{"$f":"IF(A70 = \"\", \"\",VLOOKUP(A70,Master!$B$12:$T$78,COLUMN(Master!$N$1)-1, FALSE))","v":"Yes"},{"$f":"IF(A70 = \"\", \"\",VLOOKUP(A70,Master!$B$12:$T$78,COLUMN(Master!$O$1)-1, FALSE))","v":"0-9m²"},{"$f":"IF(A70 = \"\", \"\",VLOOKUP(A70,Master!$B$12:$T$78,COLUMN(Master!$P$1)-1, FALSE))","v":"Container"},{"$f":"IF(A70 = \"\", \"\",VLOOKUP(A70,Master!$B$12:$T$78,COLUMN(Master!$Q$1)-1, FALSE))","v":"Offsite"},{"$f":"IF(A70 = \"\", \"\",VLOOKUP(A70,Master!$B$12:$T$78,COLUMN(Master!$R$1)-1, FALSE))","v":"Compost"},{"$f":"IF(A70 = \"\", \"\",VLOOKUP(A70,Master!$B$12:$T$78,COLUMN(Master!$C$1)-1, FALSE))","v":"Container"},{"$f":"IF(A70 = \"\", \"\",VLOOKUP(A70,Master!$B$12:$T$78,COLUMN(Master!$D$1)-1, FALSE))","v":"No"},{"$f":"IF(A70 = \"\", \"\",VLOOKUP(A70,Master!$B$12:$T$78,COLUMN(Master!$K$1)-1, FALSE))","v":"Dry"},{"$f":"IF(A70 = \"\", \"\",VLOOKUP(A70,Master!$B$12:$T$78,COLUMN(Master!$S$1)-1, FALSE))","v":"For purchase"},{"$f":"IF(A70 = \"\", \"\",VLOOKUP(A70,Master!$B$12:$T$78,COLUMN(Master!$T$1)-1, FALSE))","v":"Conveyance"}]
["Microbial Fuel Cell Latrine",{"$f":"IF(A71 = \"\", \"\",VLOOKUP(A71,Master!$B$12:$T$78,COLUMN(Master!$L$1)-1, FALSE))","v":"Household"},{"$f":"IF(A71 = \"\", \"\",VLOOKUP(A71,Master!$B$12:$T$78,COLUMN(Master!$M$1)-1, FALSE))","v":"Below ground"},{"$f":"IF(A71 = \"\", \"\",VLOOKUP(A71,Master!$B$12:$T$78,COLUMN(Master!$N$1)-1, FALSE))","v":"No"},{"$f":"IF(A71 = \"\", \"\",VLOOKUP(A71,Master!$B$12:$T$78,COLUMN(Master!$O$1)-1, FALSE))","v":"0-9m²"},{"$f":"IF(A71 = \"\", \"\",VLOOKUP(A71,Master!$B$12:$T$78,COLUMN(Master!$P$1)-1, FALSE))","v":"NA"},{"$f":"IF(A71 = \"\", \"\",VLOOKUP(A71,Master!$B$12:$T$78,COLUMN(Master!$Q$1)-1, FALSE))","v":"Onsite"},{"$f":"IF(A71 = \"\", \"\",VLOOKUP(A71,Master!$B$12:$T$78,COLUMN(Master!$R$1)-1, FALSE))","v":"Compost"},{"$f":"IF(A71 = \"\", \"\",VLOOKUP(A71,Master!$B$12:$T$78,COLUMN(Master!$C$1)-1, FALSE))","v":"Sit"},{"$f":"IF(A71 = \"\", \"\",VLOOKUP(A71,Master!$B$12:$T$78,COLUMN(Master!$D$1)-1, FALSE))","v":"No"},{"$f":"IF(A71 = \"\", \"\",VLOOKUP(A71,Master!$B$12:$T$78,COLUMN(Master!$K$1)-1, FALSE))","v":"Dry"},{"$f":"IF(A71 = \"\", \"\",VLOOKUP(A71,Master!$B$12:$T$78,COLUMN(Master!$S$1)-1, FALSE))","v":"In development"},{"$f":"IF(A71 = \"\", \"\",VLOOKUP(A71,Master!$B$12:$T$78,COLUMN(Master!$T$1)-1, FALSE))","v":"Use and/or disposal"}]
["MoSan Toilet",{"$f":"IF(A72 = \"\", \"\",VLOOKUP(A72,Master!$B$12:$T$78,COLUMN(Master!$L$1)-1, FALSE))","v":"Household"},{"$f":"IF(A72 = \"\", \"\",VLOOKUP(A72,Master!$B$12:$T$78,COLUMN(Master!$M$1)-1, FALSE))","v":"Container"},{"$f":"IF(A72 = \"\", \"\",VLOOKUP(A72,Master!$B$12:$T$78,COLUMN(Master!$N$1)-1, FALSE))","v":"Yes"},{"$f":"IF(A72 = \"\", \"\",VLOOKUP(A72,Master!$B$12:$T$78,COLUMN(Master!$O$1)-1, FALSE))","v":"0-9m²"},{"$f":"IF(A72 = \"\", \"\",VLOOKUP(A72,Master!$B$12:$T$78,COLUMN(Master!$P$1)-1, FALSE))","v":"Container"},{"$f":"IF(A72 = \"\", \"\",VLOOKUP(A72,Master!$B$12:$T$78,COLUMN(Master!$Q$1)-1, FALSE))","v":"Offsite"},{"$f":"IF(A72 = \"\", \"\",VLOOKUP(A72,Master!$B$12:$T$78,COLUMN(Master!$R$1)-1, FALSE))","v":"Compost"},{"$f":"IF(A72 = \"\", \"\",VLOOKUP(A72,Master!$B$12:$T$78,COLUMN(Master!$C$1)-1, FALSE))","v":"Container"},{"$f":"IF(A72 = \"\", \"\",VLOOKUP(A72,Master!$B$12:$T$78,COLUMN(Master!$D$1)-1, FALSE))","v":"Yes"},{"$f":"IF(A72 = \"\", \"\",VLOOKUP(A72,Master!$B$12:$T$78,COLUMN(Master!$K$1)-1, FALSE))","v":"Dry"},{"$f":"IF(A72 = \"\", \"\",VLOOKUP(A72,Master!$B$12:$T$78,COLUMN(Master!$S$1)-1, FALSE))","v":"For purchase"},{"$f":"IF(A72 = \"\", \"\",VLOOKUP(A72,Master!$B$12:$T$78,COLUMN(Master!$T$1)-1, FALSE))","v":"Conveyance"}]
["Otji Toilet",{"$f":"IF(A73 = \"\", \"\",VLOOKUP(A73,Master!$B$12:$T$78,COLUMN(Master!$L$1)-1, FALSE))","v":"Household"},{"$f":"IF(A73 = \"\", \"\",VLOOKUP(A73,Master!$B$12:$T$78,COLUMN(Master!$M$1)-1, FALSE))","v":"Below ground"},{"$f":"IF(A73 = \"\", \"\",VLOOKUP(A73,Master!$B$12:$T$78,COLUMN(Master!$N$1)-1, FALSE))","v":"No"},{"$f":"IF(A73 = \"\", \"\",VLOOKUP(A73,Master!$B$12:$T$78,COLUMN(Master!$O$1)-1, FALSE))","v":"0-9m²"},{"$f":"IF(A73 = \"\", \"\",VLOOKUP(A73,Master!$B$12:$T$78,COLUMN(Master!$P$1)-1, FALSE))","v":"Manual"},{"$f":"IF(A73 = \"\", \"\",VLOOKUP(A73,Master!$B$12:$T$78,COLUMN(Master!$Q$1)-1, FALSE))","v":"Offsite"},{"$f":"IF(A73 = \"\", \"\",VLOOKUP(A73,Master!$B$12:$T$78,COLUMN(Master!$R$1)-1, FALSE))","v":"Compost"},{"$f":"IF(A73 = \"\", \"\",VLOOKUP(A73,Master!$B$12:$T$78,COLUMN(Master!$C$1)-1, FALSE))","v":"Sit"},{"$f":"IF(A73 = \"\", \"\",VLOOKUP(A73,Master!$B$12:$T$78,COLUMN(Master!$D$1)-1, FALSE))","v":"Yes"},{"$f":"IF(A73 = \"\", \"\",VLOOKUP(A73,Master!$B$12:$T$78,COLUMN(Master!$K$1)-1, FALSE))","v":"Dry"},{"$f":"IF(A73 = \"\", \"\",VLOOKUP(A73,Master!$B$12:$T$78,COLUMN(Master!$S$1)-1, FALSE))","v":"For purchase"},{"$f":"IF(A73 = \"\", \"\",VLOOKUP(A73,Master!$B$12:$T$78,COLUMN(Master!$T$1)-1, FALSE))","v":"Conveyance "}]
["Oxford Emergency Chemical Toilet",{"$f":"IF(A74 = \"\", \"\",VLOOKUP(A74,Master!$B$12:$T$78,COLUMN(Master!$L$1)-1, FALSE))","v":"Household"},{"$f":"IF(A74 = \"\", \"\",VLOOKUP(A74,Master!$B$12:$T$78,COLUMN(Master!$M$1)-1, FALSE))","v":"Container"},{"$f":"IF(A74 = \"\", \"\",VLOOKUP(A74,Master!$B$12:$T$78,COLUMN(Master!$N$1)-1, FALSE))","v":"Yes"},{"$f":"IF(A74 = \"\", \"\",VLOOKUP(A74,Master!$B$12:$T$78,COLUMN(Master!$O$1)-1, FALSE))","v":"0-9m²"},{"$f":"IF(A74 = \"\", \"\",VLOOKUP(A74,Master!$B$12:$T$78,COLUMN(Master!$P$1)-1, FALSE))","v":"Container"},{"$f":"IF(A74 = \"\", \"\",VLOOKUP(A74,Master!$B$12:$T$78,COLUMN(Master!$Q$1)-1, FALSE))","v":"Offsite"},{"$f":"IF(A74 = \"\", \"\",VLOOKUP(A74,Master!$B$12:$T$78,COLUMN(Master!$R$1)-1, FALSE))","v":"None"},{"$f":"IF(A74 = \"\", \"\",VLOOKUP(A74,Master!$B$12:$T$78,COLUMN(Master!$C$1)-1, FALSE))","v":"Container"},{"$f":"IF(A74 = \"\", \"\",VLOOKUP(A74,Master!$B$12:$T$78,COLUMN(Master!$D$1)-1, FALSE))","v":"No"},{"$f":"IF(A74 = \"\", \"\",VLOOKUP(A74,Master!$B$12:$T$78,COLUMN(Master!$K$1)-1, FALSE))","v":"Dry"},{"$f":"IF(A74 = \"\", \"\",VLOOKUP(A74,Master!$B$12:$T$78,COLUMN(Master!$S$1)-1, FALSE))","v":"For purchase"},{"$f":"IF(A74 = \"\", \"\",VLOOKUP(A74,Master!$B$12:$T$78,COLUMN(Master!$T$1)-1, FALSE))","v":"Conveyance "}]
["Peepoo Bag",{"$f":"IF(A75 = \"\", \"\",VLOOKUP(A75,Master!$B$12:$T$78,COLUMN(Master!$L$1)-1, FALSE))","v":"Either"},{"$f":"IF(A75 = \"\", \"\",VLOOKUP(A75,Master!$B$12:$T$78,COLUMN(Master!$M$1)-1, FALSE))","v":"Container"},{"$f":"IF(A75 = \"\", \"\",VLOOKUP(A75,Master!$B$12:$T$78,COLUMN(Master!$N$1)-1, FALSE))","v":"No"},{"$f":"IF(A75 = \"\", \"\",VLOOKUP(A75,Master!$B$12:$T$78,COLUMN(Master!$O$1)-1, FALSE))","v":"0-9m²"},{"$f":"IF(A75 = \"\", \"\",VLOOKUP(A75,Master!$B$12:$T$78,COLUMN(Master!$P$1)-1, FALSE))","v":"Container"},{"$f":"IF(A75 = \"\", \"\",VLOOKUP(A75,Master!$B$12:$T$78,COLUMN(Master!$Q$1)-1, FALSE))","v":"Onsite"},{"$f":"IF(A75 = \"\", \"\",VLOOKUP(A75,Master!$B$12:$T$78,COLUMN(Master!$R$1)-1, FALSE))","v":"None"},{"$f":"IF(A75 = \"\", \"\",VLOOKUP(A75,Master!$B$12:$T$78,COLUMN(Master!$C$1)-1, FALSE))","v":"Container"},{"$f":"IF(A75 = \"\", \"\",VLOOKUP(A75,Master!$B$12:$T$78,COLUMN(Master!$D$1)-1, FALSE))","v":"No"},{"$f":"IF(A75 = \"\", \"\",VLOOKUP(A75,Master!$B$12:$T$78,COLUMN(Master!$K$1)-1, FALSE))","v":"Dry"},{"$f":"IF(A75 = \"\", \"\",VLOOKUP(A75,Master!$B$12:$T$78,COLUMN(Master!$S$1)-1, FALSE))","v":"For purchase"},{"$f":"IF(A75 = \"\", \"\",VLOOKUP(A75,Master!$B$12:$T$78,COLUMN(Master!$T$1)-1, FALSE))","v":"Use and/or disposal"}]
["Perfect Privy",{"$f":"IF(A76 = \"\", \"\",VLOOKUP(A76,Master!$B$12:$T$78,COLUMN(Master!$L$1)-1, FALSE))","v":"Household"},{"$f":"IF(A76 = \"\", \"\",VLOOKUP(A76,Master!$B$12:$T$78,COLUMN(Master!$M$1)-1, FALSE))","v":"Container"},{"$f":"IF(A76 = \"\", \"\",VLOOKUP(A76,Master!$B$12:$T$78,COLUMN(Master!$N$1)-1, FALSE))","v":"Yes"},{"$f":"IF(A76 = \"\", \"\",VLOOKUP(A76,Master!$B$12:$T$78,COLUMN(Master!$O$1)-1, FALSE))","v":"0-9m²"},{"$f":"IF(A76 = \"\", \"\",VLOOKUP(A76,Master!$B$12:$T$78,COLUMN(Master!$P$1)-1, FALSE))","v":"Container"},{"$f":"IF(A76 = \"\", \"\",VLOOKUP(A76,Master!$B$12:$T$78,COLUMN(Master!$Q$1)-1, FALSE))","v":"Offsite"},{"$f":"IF(A76 = \"\", \"\",VLOOKUP(A76,Master!$B$12:$T$78,COLUMN(Master!$R$1)-1, FALSE))","v":"Compost"},{"$f":"IF(A76 = \"\", \"\",VLOOKUP(A76,Master!$B$12:$T$78,COLUMN(Master!$C$1)-1, FALSE))","v":"Container"},{"$f":"IF(A76 = \"\", \"\",VLOOKUP(A76,Master!$B$12:$T$78,COLUMN(Master!$D$1)-1, FALSE))","v":"Yes"},{"$f":"IF(A76 = \"\", \"\",VLOOKUP(A76,Master!$B$12:$T$78,COLUMN(Master!$K$1)-1, FALSE))","v":"Dry"},{"$f":"IF(A76 = \"\", \"\",VLOOKUP(A76,Master!$B$12:$T$78,COLUMN(Master!$S$1)-1, FALSE))","v":"For purchase"},{"$f":"IF(A76 = \"\", \"\",VLOOKUP(A76,Master!$B$12:$T$78,COLUMN(Master!$T$1)-1, FALSE))","v":"Conveyance "}]
["RTI Toilet",{"$f":"IF(A77 = \"\", \"\",VLOOKUP(A77,Master!$B$12:$T$78,COLUMN(Master!$L$1)-1, FALSE))","v":"Household"},{"$f":"IF(A77 = \"\", \"\",VLOOKUP(A77,Master!$B$12:$T$78,COLUMN(Master!$M$1)-1, FALSE))","v":"Above ground"},{"$f":"IF(A77 = \"\", \"\",VLOOKUP(A77,Master!$B$12:$T$78,COLUMN(Master!$N$1)-1, FALSE))","v":"Yes"},{"$f":"IF(A77 = \"\", \"\",VLOOKUP(A77,Master!$B$12:$T$78,COLUMN(Master!$O$1)-1, FALSE))","v":"9-49m²"},{"$f":"IF(A77 = \"\", \"\",VLOOKUP(A77,Master!$B$12:$T$78,COLUMN(Master!$P$1)-1, FALSE))","v":"NA"},{"$f":"IF(A77 = \"\", \"\",VLOOKUP(A77,Master!$B$12:$T$78,COLUMN(Master!$Q$1)-1, FALSE))","v":"Onsite"},{"$f":"IF(A77 = \"\", \"\",VLOOKUP(A77,Master!$B$12:$T$78,COLUMN(Master!$R$1)-1, FALSE))","v":"None"},{"$f":"IF(A77 = \"\", \"\",VLOOKUP(A77,Master!$B$12:$T$78,COLUMN(Master!$C$1)-1, FALSE))","v":"Sit"},{"$f":"IF(A77 = \"\", \"\",VLOOKUP(A77,Master!$B$12:$T$78,COLUMN(Master!$D$1)-1, FALSE))","v":"Yes"},{"$f":"IF(A77 = \"\", \"\",VLOOKUP(A77,Master!$B$12:$T$78,COLUMN(Master!$K$1)-1, FALSE))","v":"Dry"},{"$f":"IF(A77 = \"\", \"\",VLOOKUP(A77,Master!$B$12:$T$78,COLUMN(Master!$S$1)-1, FALSE))","v":"In development"},{"$f":"IF(A77 = \"\", \"\",VLOOKUP(A77,Master!$B$12:$T$78,COLUMN(Master!$T$1)-1, FALSE))","v":"Use and/or disposal"}]
["Sanergy Model - Fresh Life Toilet",{"$f":"IF(A78 = \"\", \"\",VLOOKUP(A78,Master!$B$12:$T$78,COLUMN(Master!$L$1)-1, FALSE))","v":"Either"},{"$f":"IF(A78 = \"\", \"\",VLOOKUP(A78,Master!$B$12:$T$78,COLUMN(Master!$M$1)-1, FALSE))","v":"Container"},{"$f":"IF(A78 = \"\", \"\",VLOOKUP(A78,Master!$B$12:$T$78,COLUMN(Master!$N$1)-1, FALSE))","v":"Yes"},{"$f":"IF(A78 = \"\", \"\",VLOOKUP(A78,Master!$B$12:$T$78,COLUMN(Master!$O$1)-1, FALSE))","v":"0-9m²"},{"$f":"IF(A78 = \"\", \"\",VLOOKUP(A78,Master!$B$12:$T$78,COLUMN(Master!$P$1)-1, FALSE))","v":"Container"},{"$f":"IF(A78 = \"\", \"\",VLOOKUP(A78,Master!$B$12:$T$78,COLUMN(Master!$Q$1)-1, FALSE))","v":"Offsite"},{"$f":"IF(A78 = \"\", \"\",VLOOKUP(A78,Master!$B$12:$T$78,COLUMN(Master!$R$1)-1, FALSE))","v":"Compost"},{"$f":"IF(A78 = \"\", \"\",VLOOKUP(A78,Master!$B$12:$T$78,COLUMN(Master!$C$1)-1, FALSE))","v":"Container"},{"$f":"IF(A78 = \"\", \"\",VLOOKUP(A78,Master!$B$12:$T$78,COLUMN(Master!$D$1)-1, FALSE))","v":"Yes"},{"$f":"IF(A78 = \"\", \"\",VLOOKUP(A78,Master!$B$12:$T$78,COLUMN(Master!$K$1)-1, FALSE))","v":"Dry"},{"$f":"IF(A78 = \"\", \"\",VLOOKUP(A78,Master!$B$12:$T$78,COLUMN(Master!$S$1)-1, FALSE))","v":"For purchase"},{"$f":"IF(A78 = \"\", \"\",VLOOKUP(A78,Master!$B$12:$T$78,COLUMN(Master!$T$1)-1, FALSE))","v":"Conveyance"}]
["Sanivation Solutions Bucket Toilet",{"$f":"IF(A79 = \"\", \"\",VLOOKUP(A79,Master!$B$12:$T$78,COLUMN(Master!$L$1)-1, FALSE))","v":"Household"},{"$f":"IF(A79 = \"\", \"\",VLOOKUP(A79,Master!$B$12:$T$78,COLUMN(Master!$M$1)-1, FALSE))","v":"Container"},{"$f":"IF(A79 = \"\", \"\",VLOOKUP(A79,Master!$B$12:$T$78,COLUMN(Master!$N$1)-1, FALSE))","v":"Yes"},{"$f":"IF(A79 = \"\", \"\",VLOOKUP(A79,Master!$B$12:$T$78,COLUMN(Master!$O$1)-1, FALSE))","v":"0-9m²"},{"$f":"IF(A79 = \"\", \"\",VLOOKUP(A79,Master!$B$12:$T$78,COLUMN(Master!$P$1)-1, FALSE))","v":"Container"},{"$f":"IF(A79 = \"\", \"\",VLOOKUP(A79,Master!$B$12:$T$78,COLUMN(Master!$Q$1)-1, FALSE))","v":"Offsite"},{"$f":"IF(A79 = \"\", \"\",VLOOKUP(A79,Master!$B$12:$T$78,COLUMN(Master!$R$1)-1, FALSE))","v":"Briquettes"},{"$f":"IF(A79 = \"\", \"\",VLOOKUP(A79,Master!$B$12:$T$78,COLUMN(Master!$C$1)-1, FALSE))","v":"Container"},{"$f":"IF(A79 = \"\", \"\",VLOOKUP(A79,Master!$B$12:$T$78,COLUMN(Master!$D$1)-1, FALSE))","v":"Yes"},{"$f":"IF(A79 = \"\", \"\",VLOOKUP(A79,Master!$B$12:$T$78,COLUMN(Master!$K$1)-1, FALSE))","v":"Dry"},{"$f":"IF(A79 = \"\", \"\",VLOOKUP(A79,Master!$B$12:$T$78,COLUMN(Master!$S$1)-1, FALSE))","v":"For purchase"},{"$f":"IF(A79 = \"\", \"\",VLOOKUP(A79,Master!$B$12:$T$78,COLUMN(Master!$T$1)-1, FALSE))","v":"Conveyance"}]
["Separett Toilets",{"$f":"IF(A80 = \"\", \"\",VLOOKUP(A80,Master!$B$12:$T$78,COLUMN(Master!$L$1)-1, FALSE))","v":"Household"},{"$f":"IF(A80 = \"\", \"\",VLOOKUP(A80,Master!$B$12:$T$78,COLUMN(Master!$M$1)-1, FALSE))","v":"Container"},{"$f":"IF(A80 = \"\", \"\",VLOOKUP(A80,Master!$B$12:$T$78,COLUMN(Master!$N$1)-1, FALSE))","v":"Yes"},{"$f":"IF(A80 = \"\", \"\",VLOOKUP(A80,Master!$B$12:$T$78,COLUMN(Master!$O$1)-1, FALSE))","v":"0-9m²"},{"$f":"IF(A80 = \"\", \"\",VLOOKUP(A80,Master!$B$12:$T$78,COLUMN(Master!$P$1)-1, FALSE))","v":"Container"},{"$f":"IF(A80 = \"\", \"\",VLOOKUP(A80,Master!$B$12:$T$78,COLUMN(Master!$Q$1)-1, FALSE))","v":"Offsite"},{"$f":"IF(A80 = \"\", \"\",VLOOKUP(A80,Master!$B$12:$T$78,COLUMN(Master!$R$1)-1, FALSE))","v":"Compost"},{"$f":"IF(A80 = \"\", \"\",VLOOKUP(A80,Master!$B$12:$T$78,COLUMN(Master!$C$1)-1, FALSE))","v":"Container"},{"$f":"IF(A80 = \"\", \"\",VLOOKUP(A80,Master!$B$12:$T$78,COLUMN(Master!$D$1)-1, FALSE))","v":"Yes"},{"$f":"IF(A80 = \"\", \"\",VLOOKUP(A80,Master!$B$12:$T$78,COLUMN(Master!$K$1)-1, FALSE))","v":"Dry"},{"$f":"IF(A80 = \"\", \"\",VLOOKUP(A80,Master!$B$12:$T$78,COLUMN(Master!$S$1)-1, FALSE))","v":"For purchase"},{"$f":"IF(A80 = \"\", \"\",VLOOKUP(A80,Master!$B$12:$T$78,COLUMN(Master!$T$1)-1, FALSE))","v":"Conveyance"}]
["Septic Tank",{"$f":"IF(A81 = \"\", \"\",VLOOKUP(A81,Master!$B$12:$T$78,COLUMN(Master!$L$1)-1, FALSE))","v":"Either"},{"$f":"IF(A81 = \"\", \"\",VLOOKUP(A81,Master!$B$12:$T$78,COLUMN(Master!$M$1)-1, FALSE))","v":"Above ground"},{"$f":"IF(A81 = \"\", \"\",VLOOKUP(A81,Master!$B$12:$T$78,COLUMN(Master!$N$1)-1, FALSE))","v":"Yes"},{"$f":"IF(A81 = \"\", \"\",VLOOKUP(A81,Master!$B$12:$T$78,COLUMN(Master!$O$1)-1, FALSE))","v":"0-9m²"},{"$f":"IF(A81 = \"\", \"\",VLOOKUP(A81,Master!$B$12:$T$78,COLUMN(Master!$P$1)-1, FALSE))","v":"Manual/Pump"},{"$f":"IF(A81 = \"\", \"\",VLOOKUP(A81,Master!$B$12:$T$78,COLUMN(Master!$Q$1)-1, FALSE))","v":"Offsite"},{"$f":"IF(A81 = \"\", \"\",VLOOKUP(A81,Master!$B$12:$T$78,COLUMN(Master!$R$1)-1, FALSE))","v":"None"},{"$f":"IF(A81 = \"\", \"\",VLOOKUP(A81,Master!$B$12:$T$78,COLUMN(Master!$C$1)-1, FALSE))","v":"Sit/Squat"},{"$f":"IF(A81 = \"\", \"\",VLOOKUP(A81,Master!$B$12:$T$78,COLUMN(Master!$D$1)-1, FALSE))","v":"No"},{"$f":"IF(A81 = \"\", \"\",VLOOKUP(A81,Master!$B$12:$T$78,COLUMN(Master!$K$1)-1, FALSE))","v":"Wet"},{"$f":"IF(A81 = \"\", \"\",VLOOKUP(A81,Master!$B$12:$T$78,COLUMN(Master!$S$1)-1, FALSE))","v":"For purchase"},{"$f":"IF(A81 = \"\", \"\",VLOOKUP(A81,Master!$B$12:$T$78,COLUMN(Master!$T$1)-1, FALSE))","v":"Conveyance"}]
["SimSan BucketMate Toilet",{"$f":"IF(A82 = \"\", \"\",VLOOKUP(A82,Master!$B$12:$T$78,COLUMN(Master!$L$1)-1, FALSE))","v":"Household"},{"$f":"IF(A82 = \"\", \"\",VLOOKUP(A82,Master!$B$12:$T$78,COLUMN(Master!$M$1)-1, FALSE))","v":"Container"},{"$f":"IF(A82 = \"\", \"\",VLOOKUP(A82,Master!$B$12:$T$78,COLUMN(Master!$N$1)-1, FALSE))","v":"Yes"},{"$f":"IF(A82 = \"\", \"\",VLOOKUP(A82,Master!$B$12:$T$78,COLUMN(Master!$O$1)-1, FALSE))","v":"0-9m²"},{"$f":"IF(A82 = \"\", \"\",VLOOKUP(A82,Master!$B$12:$T$78,COLUMN(Master!$P$1)-1, FALSE))","v":"Container"},{"$f":"IF(A82 = \"\", \"\",VLOOKUP(A82,Master!$B$12:$T$78,COLUMN(Master!$Q$1)-1, FALSE))","v":"Offsite"},{"$f":"IF(A82 = \"\", \"\",VLOOKUP(A82,Master!$B$12:$T$78,COLUMN(Master!$R$1)-1, FALSE))","v":"Compost"},{"$f":"IF(A82 = \"\", \"\",VLOOKUP(A82,Master!$B$12:$T$78,COLUMN(Master!$C$1)-1, FALSE))","v":"Container"},{"$f":"IF(A82 = \"\", \"\",VLOOKUP(A82,Master!$B$12:$T$78,COLUMN(Master!$D$1)-1, FALSE))","v":"Yes"},{"$f":"IF(A82 = \"\", \"\",VLOOKUP(A82,Master!$B$12:$T$78,COLUMN(Master!$K$1)-1, FALSE))","v":"Dry"},{"$f":"IF(A82 = \"\", \"\",VLOOKUP(A82,Master!$B$12:$T$78,COLUMN(Master!$S$1)-1, FALSE))","v":"For purchase"},{"$f":"IF(A82 = \"\", \"\",VLOOKUP(A82,Master!$B$12:$T$78,COLUMN(Master!$T$1)-1, FALSE))","v":"Conveyance"}]
["Single Pit Latrine",{"$f":"IF(A83 = \"\", \"\",VLOOKUP(A83,Master!$B$12:$T$78,COLUMN(Master!$L$1)-1, FALSE))","v":"Household"},{"$f":"IF(A83 = \"\", \"\",VLOOKUP(A83,Master!$B$12:$T$78,COLUMN(Master!$M$1)-1, FALSE))","v":"Below ground"},{"$f":"IF(A83 = \"\", \"\",VLOOKUP(A83,Master!$B$12:$T$78,COLUMN(Master!$N$1)-1, FALSE))","v":"No"},{"$f":"IF(A83 = \"\", \"\",VLOOKUP(A83,Master!$B$12:$T$78,COLUMN(Master!$O$1)-1, FALSE))","v":"0-9m²"},{"$f":"IF(A83 = \"\", \"\",VLOOKUP(A83,Master!$B$12:$T$78,COLUMN(Master!$P$1)-1, FALSE))","v":"Manual/Pump"},{"$f":"IF(A83 = \"\", \"\",VLOOKUP(A83,Master!$B$12:$T$78,COLUMN(Master!$Q$1)-1, FALSE))","v":"Offsite"},{"$f":"IF(A83 = \"\", \"\",VLOOKUP(A83,Master!$B$12:$T$78,COLUMN(Master!$R$1)-1, FALSE))","v":"None"},{"$f":"IF(A83 = \"\", \"\",VLOOKUP(A83,Master!$B$12:$T$78,COLUMN(Master!$C$1)-1, FALSE))","v":"Sit/Squat"},{"$f":"IF(A83 = \"\", \"\",VLOOKUP(A83,Master!$B$12:$T$78,COLUMN(Master!$D$1)-1, FALSE))","v":"No"},{"$f":"IF(A83 = \"\", \"\",VLOOKUP(A83,Master!$B$12:$T$78,COLUMN(Master!$K$1)-1, FALSE))","v":"Dry"},{"$f":"IF(A83 = \"\", \"\",VLOOKUP(A83,Master!$B$12:$T$78,COLUMN(Master!$S$1)-1, FALSE))","v":"Open source"},{"$f":"IF(A83 = \"\", \"\",VLOOKUP(A83,Master!$B$12:$T$78,COLUMN(Master!$T$1)-1, FALSE))","v":"Conveyance "}]
["Sistema Biobolsa - Wastewater Treatment",{"$f":"IF(A84 = \"\", \"\",VLOOKUP(A84,Master!$B$12:$T$78,COLUMN(Master!$L$1)-1, FALSE))","v":"Household"},{"$f":"IF(A84 = \"\", \"\",VLOOKUP(A84,Master!$B$12:$T$78,COLUMN(Master!$M$1)-1, FALSE))","v":"Above ground"},{"$f":"IF(A84 = \"\", \"\",VLOOKUP(A84,Master!$B$12:$T$78,COLUMN(Master!$N$1)-1, FALSE))","v":"Yes"},{"$f":"IF(A84 = \"\", \"\",VLOOKUP(A84,Master!$B$12:$T$78,COLUMN(Master!$O$1)-1, FALSE))","v":"0-9m²"},{"$f":"IF(A84 = \"\", \"\",VLOOKUP(A84,Master!$B$12:$T$78,COLUMN(Master!$P$1)-1, FALSE))","v":"NA"},{"$f":"IF(A84 = \"\", \"\",VLOOKUP(A84,Master!$B$12:$T$78,COLUMN(Master!$Q$1)-1, FALSE))","v":"Onsite"},{"$f":"IF(A84 = \"\", \"\",VLOOKUP(A84,Master!$B$12:$T$78,COLUMN(Master!$R$1)-1, FALSE))","v":"Biogas"},{"$f":"IF(A84 = \"\", \"\",VLOOKUP(A84,Master!$B$12:$T$78,COLUMN(Master!$C$1)-1, FALSE))","v":"Sit/Squat"},{"$f":"IF(A84 = \"\", \"\",VLOOKUP(A84,Master!$B$12:$T$78,COLUMN(Master!$D$1)-1, FALSE))","v":"Yes"},{"$f":"IF(A84 = \"\", \"\",VLOOKUP(A84,Master!$B$12:$T$78,COLUMN(Master!$K$1)-1, FALSE))","v":"Wet"},{"$f":"IF(A84 = \"\", \"\",VLOOKUP(A84,Master!$B$12:$T$78,COLUMN(Master!$S$1)-1, FALSE))","v":"For purchase"},{"$f":"IF(A84 = \"\", \"\",VLOOKUP(A84,Master!$B$12:$T$78,COLUMN(Master!$T$1)-1, FALSE))","v":"Use and/or disposal"}]
["Sulabh Household Toilet",{"$f":"IF(A85 = \"\", \"\",VLOOKUP(A85,Master!$B$12:$T$78,COLUMN(Master!$L$1)-1, FALSE))","v":"Household"},{"$f":"IF(A85 = \"\", \"\",VLOOKUP(A85,Master!$B$12:$T$78,COLUMN(Master!$M$1)-1, FALSE))","v":"Below ground"},{"$f":"IF(A85 = \"\", \"\",VLOOKUP(A85,Master!$B$12:$T$78,COLUMN(Master!$N$1)-1, FALSE))","v":"No"},{"$f":"IF(A85 = \"\", \"\",VLOOKUP(A85,Master!$B$12:$T$78,COLUMN(Master!$O$1)-1, FALSE))","v":"9-49m²"},{"$f":"IF(A85 = \"\", \"\",VLOOKUP(A85,Master!$B$12:$T$78,COLUMN(Master!$P$1)-1, FALSE))","v":"NA"},{"$f":"IF(A85 = \"\", \"\",VLOOKUP(A85,Master!$B$12:$T$78,COLUMN(Master!$Q$1)-1, FALSE))","v":"Onsite"},{"$f":"IF(A85 = \"\", \"\",VLOOKUP(A85,Master!$B$12:$T$78,COLUMN(Master!$R$1)-1, FALSE))","v":"Compost"},{"$f":"IF(A85 = \"\", \"\",VLOOKUP(A85,Master!$B$12:$T$78,COLUMN(Master!$C$1)-1, FALSE))","v":"Sit/Squat"},{"$f":"IF(A85 = \"\", \"\",VLOOKUP(A85,Master!$B$12:$T$78,COLUMN(Master!$D$1)-1, FALSE))","v":"Yes"},{"$f":"IF(A85 = \"\", \"\",VLOOKUP(A85,Master!$B$12:$T$78,COLUMN(Master!$K$1)-1, FALSE))","v":"Wet"},{"$f":"IF(A85 = \"\", \"\",VLOOKUP(A85,Master!$B$12:$T$78,COLUMN(Master!$S$1)-1, FALSE))","v":"For purchase"},{"$f":"IF(A85 = \"\", \"\",VLOOKUP(A85,Master!$B$12:$T$78,COLUMN(Master!$T$1)-1, FALSE))","v":"Use and/or disposal"}]
["Sun-Mar Toilet and Two-Pit System",{"$f":"IF(A86 = \"\", \"\",VLOOKUP(A86,Master!$B$12:$T$78,COLUMN(Master!$L$1)-1, FALSE))","v":"Household"},{"$f":"IF(A86 = \"\", \"\",VLOOKUP(A86,Master!$B$12:$T$78,COLUMN(Master!$M$1)-1, FALSE))","v":"Container"},{"$f":"IF(A86 = \"\", \"\",VLOOKUP(A86,Master!$B$12:$T$78,COLUMN(Master!$N$1)-1, FALSE))","v":"Yes"},{"$f":"IF(A86 = \"\", \"\",VLOOKUP(A86,Master!$B$12:$T$78,COLUMN(Master!$O$1)-1, FALSE))","v":"0-9m²"},{"$f":"IF(A86 = \"\", \"\",VLOOKUP(A86,Master!$B$12:$T$78,COLUMN(Master!$P$1)-1, FALSE))","v":"NA"},{"$f":"IF(A86 = \"\", \"\",VLOOKUP(A86,Master!$B$12:$T$78,COLUMN(Master!$Q$1)-1, FALSE))","v":"Onsite"},{"$f":"IF(A86 = \"\", \"\",VLOOKUP(A86,Master!$B$12:$T$78,COLUMN(Master!$R$1)-1, FALSE))","v":"Compost"},{"$f":"IF(A86 = \"\", \"\",VLOOKUP(A86,Master!$B$12:$T$78,COLUMN(Master!$C$1)-1, FALSE))","v":"Sit/Squat"},{"$f":"IF(A86 = \"\", \"\",VLOOKUP(A86,Master!$B$12:$T$78,COLUMN(Master!$D$1)-1, FALSE))","v":"Yes"},{"$f":"IF(A86 = \"\", \"\",VLOOKUP(A86,Master!$B$12:$T$78,COLUMN(Master!$K$1)-1, FALSE))","v":"Dry"},{"$f":"IF(A86 = \"\", \"\",VLOOKUP(A86,Master!$B$12:$T$78,COLUMN(Master!$S$1)-1, FALSE))","v":"For purchase"},{"$f":"IF(A86 = \"\", \"\",VLOOKUP(A86,Master!$B$12:$T$78,COLUMN(Master!$T$1)-1, FALSE))","v":"Use and/or disposal"}]
["TfP Space-Saver Composting Toilet (Crapper)",{"$f":"IF(A87 = \"\", \"\",VLOOKUP(A87,Master!$B$12:$T$78,COLUMN(Master!$L$1)-1, FALSE))","v":"Household"},{"$f":"IF(A87 = \"\", \"\",VLOOKUP(A87,Master!$B$12:$T$78,COLUMN(Master!$M$1)-1, FALSE))","v":"Above ground"},{"$f":"IF(A87 = \"\", \"\",VLOOKUP(A87,Master!$B$12:$T$78,COLUMN(Master!$N$1)-1, FALSE))","v":"Yes"},{"$f":"IF(A87 = \"\", \"\",VLOOKUP(A87,Master!$B$12:$T$78,COLUMN(Master!$O$1)-1, FALSE))","v":"0-9m²"},{"$f":"IF(A87 = \"\", \"\",VLOOKUP(A87,Master!$B$12:$T$78,COLUMN(Master!$P$1)-1, FALSE))","v":"Container"},{"$f":"IF(A87 = \"\", \"\",VLOOKUP(A87,Master!$B$12:$T$78,COLUMN(Master!$Q$1)-1, FALSE))","v":"Offsite"},{"$f":"IF(A87 = \"\", \"\",VLOOKUP(A87,Master!$B$12:$T$78,COLUMN(Master!$R$1)-1, FALSE))","v":"Compost"},{"$f":"IF(A87 = \"\", \"\",VLOOKUP(A87,Master!$B$12:$T$78,COLUMN(Master!$C$1)-1, FALSE))","v":"Container"},{"$f":"IF(A87 = \"\", \"\",VLOOKUP(A87,Master!$B$12:$T$78,COLUMN(Master!$D$1)-1, FALSE))","v":"Yes"},{"$f":"IF(A87 = \"\", \"\",VLOOKUP(A87,Master!$B$12:$T$78,COLUMN(Master!$K$1)-1, FALSE))","v":"Dry"},{"$f":"IF(A87 = \"\", \"\",VLOOKUP(A87,Master!$B$12:$T$78,COLUMN(Master!$S$1)-1, FALSE))","v":"For purchase"},{"$f":"IF(A87 = \"\", \"\",VLOOKUP(A87,Master!$B$12:$T$78,COLUMN(Master!$T$1)-1, FALSE))","v":"Conveyance "}]
["Tiger Worm Toilet",{"$f":"IF(A88 = \"\", \"\",VLOOKUP(A88,Master!$B$12:$T$78,COLUMN(Master!$L$1)-1, FALSE))","v":"Household"},{"$f":"IF(A88 = \"\", \"\",VLOOKUP(A88,Master!$B$12:$T$78,COLUMN(Master!$M$1)-1, FALSE))","v":"Above ground"},{"$f":"IF(A88 = \"\", \"\",VLOOKUP(A88,Master!$B$12:$T$78,COLUMN(Master!$N$1)-1, FALSE))","v":"Yes"},{"$f":"IF(A88 = \"\", \"\",VLOOKUP(A88,Master!$B$12:$T$78,COLUMN(Master!$O$1)-1, FALSE))","v":"0-9m²"},{"$f":"IF(A88 = \"\", \"\",VLOOKUP(A88,Master!$B$12:$T$78,COLUMN(Master!$P$1)-1, FALSE))","v":"NA"},{"$f":"IF(A88 = \"\", \"\",VLOOKUP(A88,Master!$B$12:$T$78,COLUMN(Master!$Q$1)-1, FALSE))","v":"Onsite"},{"$f":"IF(A88 = \"\", \"\",VLOOKUP(A88,Master!$B$12:$T$78,COLUMN(Master!$R$1)-1, FALSE))","v":"Compost"},{"$f":"IF(A88 = \"\", \"\",VLOOKUP(A88,Master!$B$12:$T$78,COLUMN(Master!$C$1)-1, FALSE))","v":"Sit"},{"$f":"IF(A88 = \"\", \"\",VLOOKUP(A88,Master!$B$12:$T$78,COLUMN(Master!$D$1)-1, FALSE))","v":"No"},{"$f":"IF(A88 = \"\", \"\",VLOOKUP(A88,Master!$B$12:$T$78,COLUMN(Master!$K$1)-1, FALSE))","v":"Wet"},{"$f":"IF(A88 = \"\", \"\",VLOOKUP(A88,Master!$B$12:$T$78,COLUMN(Master!$S$1)-1, FALSE))","v":"For purchase"},{"$f":"IF(A88 = \"\", \"\",VLOOKUP(A88,Master!$B$12:$T$78,COLUMN(Master!$T$1)-1, FALSE))","v":"Use and/or disposal"}]
["University of Toronto Smoldering Toilet",{"$f":"IF(A89 = \"\", \"\",VLOOKUP(A89,Master!$B$12:$T$78,COLUMN(Master!$L$1)-1, FALSE))","v":"Household"},{"$f":"IF(A89 = \"\", \"\",VLOOKUP(A89,Master!$B$12:$T$78,COLUMN(Master!$M$1)-1, FALSE))","v":"Above ground"},{"$f":"IF(A89 = \"\", \"\",VLOOKUP(A89,Master!$B$12:$T$78,COLUMN(Master!$N$1)-1, FALSE))","v":"Yes"},{"$f":"IF(A89 = \"\", \"\",VLOOKUP(A89,Master!$B$12:$T$78,COLUMN(Master!$O$1)-1, FALSE))","v":"0-9m²"},{"$f":"IF(A89 = \"\", \"\",VLOOKUP(A89,Master!$B$12:$T$78,COLUMN(Master!$P$1)-1, FALSE))","v":"NA"},{"$f":"IF(A89 = \"\", \"\",VLOOKUP(A89,Master!$B$12:$T$78,COLUMN(Master!$Q$1)-1, FALSE))","v":"Onsite"},{"$f":"IF(A89 = \"\", \"\",VLOOKUP(A89,Master!$B$12:$T$78,COLUMN(Master!$R$1)-1, FALSE))","v":"None"},{"$f":"IF(A89 = \"\", \"\",VLOOKUP(A89,Master!$B$12:$T$78,COLUMN(Master!$C$1)-1, FALSE))","v":"Sit"},{"$f":"IF(A89 = \"\", \"\",VLOOKUP(A89,Master!$B$12:$T$78,COLUMN(Master!$D$1)-1, FALSE))","v":"Yes"},{"$f":"IF(A89 = \"\", \"\",VLOOKUP(A89,Master!$B$12:$T$78,COLUMN(Master!$K$1)-1, FALSE))","v":"Dry"},{"$f":"IF(A89 = \"\", \"\",VLOOKUP(A89,Master!$B$12:$T$78,COLUMN(Master!$S$1)-1, FALSE))","v":"In development"},{"$f":"IF(A89 = \"\", \"\",VLOOKUP(A89,Master!$B$12:$T$78,COLUMN(Master!$T$1)-1, FALSE))","v":"Use and/or disposal"}]
["Ventilated Improved Pit Latrine",{"$f":"IF(A90 = \"\", \"\",VLOOKUP(A90,Master!$B$12:$T$78,COLUMN(Master!$L$1)-1, FALSE))","v":"Household"},{"$f":"IF(A90 = \"\", \"\",VLOOKUP(A90,Master!$B$12:$T$78,COLUMN(Master!$M$1)-1, FALSE))","v":"Below ground"},{"$f":"IF(A90 = \"\", \"\",VLOOKUP(A90,Master!$B$12:$T$78,COLUMN(Master!$N$1)-1, FALSE))","v":"No"},{"$f":"IF(A90 = \"\", \"\",VLOOKUP(A90,Master!$B$12:$T$78,COLUMN(Master!$O$1)-1, FALSE))","v":"0-9m²"},{"$f":"IF(A90 = \"\", \"\",VLOOKUP(A90,Master!$B$12:$T$78,COLUMN(Master!$P$1)-1, FALSE))","v":"Manual/Pump"},{"$f":"IF(A90 = \"\", \"\",VLOOKUP(A90,Master!$B$12:$T$78,COLUMN(Master!$Q$1)-1, FALSE))","v":"Offsite"},{"$f":"IF(A90 = \"\", \"\",VLOOKUP(A90,Master!$B$12:$T$78,COLUMN(Master!$R$1)-1, FALSE))","v":"None"},{"$f":"IF(A90 = \"\", \"\",VLOOKUP(A90,Master!$B$12:$T$78,COLUMN(Master!$C$1)-1, FALSE))","v":"Sit/Squat"},{"$f":"IF(A90 = \"\", \"\",VLOOKUP(A90,Master!$B$12:$T$78,COLUMN(Master!$D$1)-1, FALSE))","v":"No"},{"$f":"IF(A90 = \"\", \"\",VLOOKUP(A90,Master!$B$12:$T$78,COLUMN(Master!$K$1)-1, FALSE))","v":"Dry"},{"$f":"IF(A90 = \"\", \"\",VLOOKUP(A90,Master!$B$12:$T$78,COLUMN(Master!$S$1)-1, FALSE))","v":"Open source"},{"$f":"IF(A90 = \"\", \"\",VLOOKUP(A90,Master!$B$12:$T$78,COLUMN(Master!$T$1)-1, FALSE))","v":"Conveyance"}]
["Visa Portable Chemical Toilet",{"$f":"IF(A91 = \"\", \"\",VLOOKUP(A91,Master!$B$12:$T$78,COLUMN(Master!$L$1)-1, FALSE))","v":"Household"},{"$f":"IF(A91 = \"\", \"\",VLOOKUP(A91,Master!$B$12:$T$78,COLUMN(Master!$M$1)-1, FALSE))","v":"Container"},{"$f":"IF(A91 = \"\", \"\",VLOOKUP(A91,Master!$B$12:$T$78,COLUMN(Master!$N$1)-1, FALSE))","v":"Yes"},{"$f":"IF(A91 = \"\", \"\",VLOOKUP(A91,Master!$B$12:$T$78,COLUMN(Master!$O$1)-1, FALSE))","v":"0-9m²"},{"$f":"IF(A91 = \"\", \"\",VLOOKUP(A91,Master!$B$12:$T$78,COLUMN(Master!$P$1)-1, FALSE))","v":"Container"},{"$f":"IF(A91 = \"\", \"\",VLOOKUP(A91,Master!$B$12:$T$78,COLUMN(Master!$Q$1)-1, FALSE))","v":"Offsite"},{"$f":"IF(A91 = \"\", \"\",VLOOKUP(A91,Master!$B$12:$T$78,COLUMN(Master!$R$1)-1, FALSE))","v":"Compost"},{"$f":"IF(A91 = \"\", \"\",VLOOKUP(A91,Master!$B$12:$T$78,COLUMN(Master!$C$1)-1, FALSE))","v":"Container"},{"$f":"IF(A91 = \"\", \"\",VLOOKUP(A91,Master!$B$12:$T$78,COLUMN(Master!$D$1)-1, FALSE))","v":"No"},{"$f":"IF(A91 = \"\", \"\",VLOOKUP(A91,Master!$B$12:$T$78,COLUMN(Master!$K$1)-1, FALSE))","v":"Wet"},{"$f":"IF(A91 = \"\", \"\",VLOOKUP(A91,Master!$B$12:$T$78,COLUMN(Master!$S$1)-1, FALSE))","v":"For purchase"},{"$f":"IF(A91 = \"\", \"\",VLOOKUP(A91,Master!$B$12:$T$78,COLUMN(Master!$T$1)-1, FALSE))","v":"Conveyance "}]
["WooWoo Waterless Toilets (KL1, KL2, KL3, STK)",{"$f":"IF(A92 = \"\", \"\",VLOOKUP(A92,Master!$B$12:$T$78,COLUMN(Master!$L$1)-1, FALSE))","v":"Community"},{"$f":"IF(A92 = \"\", \"\",VLOOKUP(A92,Master!$B$12:$T$78,COLUMN(Master!$M$1)-1, FALSE))","v":"Above ground"},{"$f":"IF(A92 = \"\", \"\",VLOOKUP(A92,Master!$B$12:$T$78,COLUMN(Master!$N$1)-1, FALSE))","v":"Yes"},{"$f":"IF(A92 = \"\", \"\",VLOOKUP(A92,Master!$B$12:$T$78,COLUMN(Master!$O$1)-1, FALSE))","v":"0-9m²"},{"$f":"IF(A92 = \"\", \"\",VLOOKUP(A92,Master!$B$12:$T$78,COLUMN(Master!$P$1)-1, FALSE))","v":"NA"},{"$f":"IF(A92 = \"\", \"\",VLOOKUP(A92,Master!$B$12:$T$78,COLUMN(Master!$Q$1)-1, FALSE))","v":"Onsite"},{"$f":"IF(A92 = \"\", \"\",VLOOKUP(A92,Master!$B$12:$T$78,COLUMN(Master!$R$1)-1, FALSE))","v":"Compost"},{"$f":"IF(A92 = \"\", \"\",VLOOKUP(A92,Master!$B$12:$T$78,COLUMN(Master!$C$1)-1, FALSE))","v":"Sit"},{"$f":"IF(A92 = \"\", \"\",VLOOKUP(A92,Master!$B$12:$T$78,COLUMN(Master!$D$1)-1, FALSE))","v":"Yes"},{"$f":"IF(A92 = \"\", \"\",VLOOKUP(A92,Master!$B$12:$T$78,COLUMN(Master!$K$1)-1, FALSE))","v":"Dry"},{"$f":"IF(A92 = \"\", \"\",VLOOKUP(A92,Master!$B$12:$T$78,COLUMN(Master!$S$1)-1, FALSE))","v":"For purchase"},{"$f":"IF(A92 = \"\", \"\",VLOOKUP(A92,Master!$B$12:$T$78,COLUMN(Master!$T$1)-1, FALSE))","v":"Use and/or disposal"}]
["X-Runner",{"$f":"IF(A93 = \"\", \"\",VLOOKUP(A93,Master!$B$12:$T$78,COLUMN(Master!$L$1)-1, FALSE))","v":"Household"},{"$f":"IF(A93 = \"\", \"\",VLOOKUP(A93,Master!$B$12:$T$78,COLUMN(Master!$M$1)-1, FALSE))","v":"Container"},{"$f":"IF(A93 = \"\", \"\",VLOOKUP(A93,Master!$B$12:$T$78,COLUMN(Master!$N$1)-1, FALSE))","v":"Yes"},{"$f":"IF(A93 = \"\", \"\",VLOOKUP(A93,Master!$B$12:$T$78,COLUMN(Master!$O$1)-1, FALSE))","v":"0-9m²"},{"$f":"IF(A93 = \"\", \"\",VLOOKUP(A93,Master!$B$12:$T$78,COLUMN(Master!$P$1)-1, FALSE))","v":"Container"},{"$f":"IF(A93 = \"\", \"\",VLOOKUP(A93,Master!$B$12:$T$78,COLUMN(Master!$Q$1)-1, FALSE))","v":"Offsite"},{"$f":"IF(A93 = \"\", \"\",VLOOKUP(A93,Master!$B$12:$T$78,COLUMN(Master!$R$1)-1, FALSE))","v":"Compost"},{"$f":"IF(A93 = \"\", \"\",VLOOKUP(A93,Master!$B$12:$T$78,COLUMN(Master!$C$1)-1, FALSE))","v":"Container"},{"$f":"IF(A93 = \"\", \"\",VLOOKUP(A93,Master!$B$12:$T$78,COLUMN(Master!$D$1)-1, FALSE))","v":"Yes"},{"$f":"IF(A93 = \"\", \"\",VLOOKUP(A93,Master!$B$12:$T$78,COLUMN(Master!$K$1)-1, FALSE))","v":"Dry"},{"$f":"IF(A93 = \"\", \"\",VLOOKUP(A93,Master!$B$12:$T$78,COLUMN(Master!$S$1)-1, FALSE))","v":"For purchase"},{"$f":"IF(A93 = \"\", \"\",VLOOKUP(A93,Master!$B$12:$T$78,COLUMN(Master!$T$1)-1, FALSE))","v":"Conveyance "}]
[null,{"$f":"IF(A94 = \"\", \"\",VLOOKUP(A94,Master!$B$12:$T$78,COLUMN(Master!$L$1)-1, FALSE))","v":""},{"$f":"IF(A94 = \"\", \"\",VLOOKUP(A94,Master!$B$12:$T$78,COLUMN(Master!$M$1)-1, FALSE))","v":""},{"$f":"IF(A94 = \"\", \"\",VLOOKUP(A94,Master!$B$12:$T$78,COLUMN(Master!$N$1)-1, FALSE))","v":""},{"$f":"IF(A94 = \"\", \"\",VLOOKUP(A94,Master!$B$12:$T$78,COLUMN(Master!$O$1)-1, FALSE))","v":""},{"$f":"IF(A94 = \"\", \"\",VLOOKUP(A94,Master!$B$12:$T$78,COLUMN(Master!$P$1)-1, FALSE))","v":""},{"$f":"IF(A94 = \"\", \"\",VLOOKUP(A94,Master!$B$12:$T$78,COLUMN(Master!$Q$1)-1, FALSE))","v":""},{"$f":"IF(A94 = \"\", \"\",VLOOKUP(A94,Master!$B$12:$T$78,COLUMN(Master!$R$1)-1, FALSE))","v":""},{"$f":"IF(A94 = \"\", \"\",VLOOKUP(A94,Master!$B$12:$T$78,COLUMN(Master!$C$1)-1, FALSE))","v":""},{"$f":"IF(A94 = \"\", \"\",VLOOKUP(A94,Master!$B$12:$T$78,COLUMN(Master!$D$1)-1, FALSE))","v":""},{"$f":"IF(A94 = \"\", \"\",VLOOKUP(A94,Master!$B$12:$T$78,COLUMN(Master!$K$1)-1, FALSE))","v":""},{"$f":"IF(A94 = \"\", \"\",VLOOKUP(A94,Master!$B$12:$T$78,COLUMN(Master!$S$1)-1, FALSE))","v":""},{"$f":"IF(A94 = \"\", \"\",VLOOKUP(A94,Master!$B$12:$T$78,COLUMN(Master!$T$1)-1, FALSE))","v":""}]
[null,{"$f":"IF(A95 = \"\", \"\",VLOOKUP(A95,Master!$B$12:$T$78,COLUMN(Master!$L$1)-1, FALSE))","v":""},{"$f":"IF(A95 = \"\", \"\",VLOOKUP(A95,Master!$B$12:$T$78,COLUMN(Master!$M$1)-1, FALSE))","v":""},{"$f":"IF(A95 = \"\", \"\",VLOOKUP(A95,Master!$B$12:$T$78,COLUMN(Master!$N$1)-1, FALSE))","v":""},{"$f":"IF(A95 = \"\", \"\",VLOOKUP(A95,Master!$B$12:$T$78,COLUMN(Master!$O$1)-1, FALSE))","v":""},{"$f":"IF(A95 = \"\", \"\",VLOOKUP(A95,Master!$B$12:$T$78,COLUMN(Master!$P$1)-1, FALSE))","v":""},{"$f":"IF(A95 = \"\", \"\",VLOOKUP(A95,Master!$B$12:$T$78,COLUMN(Master!$Q$1)-1, FALSE))","v":""},{"$f":"IF(A95 = \"\", \"\",VLOOKUP(A95,Master!$B$12:$T$78,COLUMN(Master!$R$1)-1, FALSE))","v":""},{"$f":"IF(A95 = \"\", \"\",VLOOKUP(A95,Master!$B$12:$T$78,COLUMN(Master!$C$1)-1, FALSE))","v":""},{"$f":"IF(A95 = \"\", \"\",VLOOKUP(A95,Master!$B$12:$T$78,COLUMN(Master!$D$1)-1, FALSE))","v":""},{"$f":"IF(A95 = \"\", \"\",VLOOKUP(A95,Master!$B$12:$T$78,COLUMN(Master!$K$1)-1, FALSE))","v":""},{"$f":"IF(A95 = \"\", \"\",VLOOKUP(A95,Master!$B$12:$T$78,COLUMN(Master!$S$1)-1, FALSE))","v":""},{"$f":"IF(A95 = \"\", \"\",VLOOKUP(A95,Master!$B$12:$T$78,COLUMN(Master!$T$1)-1, FALSE))","v":""}]
[null,{"$f":"IF(A96 = \"\", \"\",VLOOKUP(A96,Master!$B$12:$T$78,COLUMN(Master!$L$1)-1, FALSE))","v":""},{"$f":"IF(A96 = \"\", \"\",VLOOKUP(A96,Master!$B$12:$T$78,COLUMN(Master!$M$1)-1, FALSE))","v":""},{"$f":"IF(A96 = \"\", \"\",VLOOKUP(A96,Master!$B$12:$T$78,COLUMN(Master!$N$1)-1, FALSE))","v":""},{"$f":"IF(A96 = \"\", \"\",VLOOKUP(A96,Master!$B$12:$T$78,COLUMN(Master!$O$1)-1, FALSE))","v":""},{"$f":"IF(A96 = \"\", \"\",VLOOKUP(A96,Master!$B$12:$T$78,COLUMN(Master!$P$1)-1, FALSE))","v":""},{"$f":"IF(A96 = \"\", \"\",VLOOKUP(A96,Master!$B$12:$T$78,COLUMN(Master!$Q$1)-1, FALSE))","v":""},{"$f":"IF(A96 = \"\", \"\",VLOOKUP(A96,Master!$B$12:$T$78,COLUMN(Master!$R$1)-1, FALSE))","v":""},{"$f":"IF(A96 = \"\", \"\",VLOOKUP(A96,Master!$B$12:$T$78,COLUMN(Master!$C$1)-1, FALSE))","v":""},{"$f":"IF(A96 = \"\", \"\",VLOOKUP(A96,Master!$B$12:$T$78,COLUMN(Master!$D$1)-1, FALSE))","v":""},{"$f":"IF(A96 = \"\", \"\",VLOOKUP(A96,Master!$B$12:$T$78,COLUMN(Master!$K$1)-1, FALSE))","v":""},{"$f":"IF(A96 = \"\", \"\",VLOOKUP(A96,Master!$B$12:$T$78,COLUMN(Master!$S$1)-1, FALSE))","v":""},{"$f":"IF(A96 = \"\", \"\",VLOOKUP(A96,Master!$B$12:$T$78,COLUMN(Master!$T$1)-1, FALSE))","v":""}]
[null,{"$f":"IF(A97 = \"\", \"\",VLOOKUP(A97,Master!$B$12:$T$78,COLUMN(Master!$L$1)-1, FALSE))","v":""},{"$f":"IF(A97 = \"\", \"\",VLOOKUP(A97,Master!$B$12:$T$78,COLUMN(Master!$M$1)-1, FALSE))","v":""},{"$f":"IF(A97 = \"\", \"\",VLOOKUP(A97,Master!$B$12:$T$78,COLUMN(Master!$N$1)-1, FALSE))","v":""},{"$f":"IF(A97 = \"\", \"\",VLOOKUP(A97,Master!$B$12:$T$78,COLUMN(Master!$O$1)-1, FALSE))","v":""},{"$f":"IF(A97 = \"\", \"\",VLOOKUP(A97,Master!$B$12:$T$78,COLUMN(Master!$P$1)-1, FALSE))","v":""},{"$f":"IF(A97 = \"\", \"\",VLOOKUP(A97,Master!$B$12:$T$78,COLUMN(Master!$Q$1)-1, FALSE))","v":""},{"$f":"IF(A97 = \"\", \"\",VLOOKUP(A97,Master!$B$12:$T$78,COLUMN(Master!$R$1)-1, FALSE))","v":""},{"$f":"IF(A97 = \"\", \"\",VLOOKUP(A97,Master!$B$12:$T$78,COLUMN(Master!$C$1)-1, FALSE))","v":""},{"$f":"IF(A97 = \"\", \"\",VLOOKUP(A97,Master!$B$12:$T$78,COLUMN(Master!$D$1)-1, FALSE))","v":""},{"$f":"IF(A97 = \"\", \"\",VLOOKUP(A97,Master!$B$12:$T$78,COLUMN(Master!$K$1)-1, FALSE))","v":""},{"$f":"IF(A97 = \"\", \"\",VLOOKUP(A97,Master!$B$12:$T$78,COLUMN(Master!$S$1)-1, FALSE))","v":""},{"$f":"IF(A97 = \"\", \"\",VLOOKUP(A97,Master!$B$12:$T$78,COLUMN(Master!$T$1)-1, FALSE))","v":""}]
[null,{"$f":"IF(A98 = \"\", \"\",VLOOKUP(A98,Master!$B$12:$T$78,COLUMN(Master!$L$1)-1, FALSE))","v":""},{"$f":"IF(A98 = \"\", \"\",VLOOKUP(A98,Master!$B$12:$T$78,COLUMN(Master!$M$1)-1, FALSE))","v":""},{"$f":"IF(A98 = \"\", \"\",VLOOKUP(A98,Master!$B$12:$T$78,COLUMN(Master!$N$1)-1, FALSE))","v":""},{"$f":"IF(A98 = \"\", \"\",VLOOKUP(A98,Master!$B$12:$T$78,COLUMN(Master!$O$1)-1, FALSE))","v":""},{"$f":"IF(A98 = \"\", \"\",VLOOKUP(A98,Master!$B$12:$T$78,COLUMN(Master!$P$1)-1, FALSE))","v":""},{"$f":"IF(A98 = \"\", \"\",VLOOKUP(A98,Master!$B$12:$T$78,COLUMN(Master!$Q$1)-1, FALSE))","v":""},{"$f":"IF(A98 = \"\", \"\",VLOOKUP(A98,Master!$B$12:$T$78,COLUMN(Master!$R$1)-1, FALSE))","v":""},{"$f":"IF(A98 = \"\", \"\",VLOOKUP(A98,Master!$B$12:$T$78,COLUMN(Master!$C$1)-1, FALSE))","v":""},{"$f":"IF(A98 = \"\", \"\",VLOOKUP(A98,Master!$B$12:$T$78,COLUMN(Master!$D$1)-1, FALSE))","v":""},null,{"$f":"IF(A98 = \"\", \"\",VLOOKUP(A98,Master!$B$12:$T$78,COLUMN(Master!$S$1)-1, FALSE))","v":""},{"$f":"IF(A98 = \"\", \"\",VLOOKUP(A98,Master!$B$12:$T$78,COLUMN(Master!$T$1)-1, FALSE))","v":""}]
[null,{"$f":"IF(A99 = \"\", \"\",VLOOKUP(A99,Master!$B$12:$T$78,COLUMN(Master!$L$1)-1, FALSE))","v":""},{"$f":"IF(A99 = \"\", \"\",VLOOKUP(A99,Master!$B$12:$T$78,COLUMN(Master!$M$1)-1, FALSE))","v":""},{"$f":"IF(A99 = \"\", \"\",VLOOKUP(A99,Master!$B$12:$T$78,COLUMN(Master!$N$1)-1, FALSE))","v":""},{"$f":"IF(A99 = \"\", \"\",VLOOKUP(A99,Master!$B$12:$T$78,COLUMN(Master!$O$1)-1, FALSE))","v":""},{"$f":"IF(A99 = \"\", \"\",VLOOKUP(A99,Master!$B$12:$T$78,COLUMN(Master!$P$1)-1, FALSE))","v":""},{"$f":"IF(A99 = \"\", \"\",VLOOKUP(A99,Master!$B$12:$T$78,COLUMN(Master!$Q$1)-1, FALSE))","v":""},{"$f":"IF(A99 = \"\", \"\",VLOOKUP(A99,Master!$B$12:$T$78,COLUMN(Master!$R$1)-1, FALSE))","v":""},{"$f":"IF(A99 = \"\", \"\",VLOOKUP(A99,Master!$B$12:$T$78,COLUMN(Master!$C$1)-1, FALSE))","v":""},{"$f":"IF(A99 = \"\", \"\",VLOOKUP(A99,Master!$B$12:$T$78,COLUMN(Master!$D$1)-1, FALSE))","v":""},null,{"$f":"IF(A99 = \"\", \"\",VLOOKUP(A99,Master!$B$12:$T$78,COLUMN(Master!$S$1)-1, FALSE))","v":""},{"$f":"IF(A99 = \"\", \"\",VLOOKUP(A99,Master!$B$12:$T$78,COLUMN(Master!$T$1)-1, FALSE))","v":""}]
[null,{"$f":"IF(A100 = \"\", \"\",VLOOKUP(A100,Master!$B$12:$T$78,COLUMN(Master!$L$1)-1, FALSE))","v":""},{"$f":"IF(A100 = \"\", \"\",VLOOKUP(A100,Master!$B$12:$T$78,COLUMN(Master!$M$1)-1, FALSE))","v":""},{"$f":"IF(A100 = \"\", \"\",VLOOKUP(A100,Master!$B$12:$T$78,COLUMN(Master!$N$1)-1, FALSE))","v":""},{"$f":"IF(A100 = \"\", \"\",VLOOKUP(A100,Master!$B$12:$T$78,COLUMN(Master!$O$1)-1, FALSE))","v":""},{"$f":"IF(A100 = \"\", \"\",VLOOKUP(A100,Master!$B$12:$T$78,COLUMN(Master!$P$1)-1, FALSE))","v":""},{"$f":"IF(A100 = \"\", \"\",VLOOKUP(A100,Master!$B$12:$T$78,COLUMN(Master!$Q$1)-1, FALSE))","v":""},{"$f":"IF(A100 = \"\", \"\",VLOOKUP(A100,Master!$B$12:$T$78,COLUMN(Master!$R$1)-1, FALSE))","v":""},{"$f":"IF(A100 = \"\", \"\",VLOOKUP(A100,Master!$B$12:$T$78,COLUMN(Master!$C$1)-1, FALSE))","v":""},{"$f":"IF(A100 = \"\", \"\",VLOOKUP(A100,Master!$B$12:$T$78,COLUMN(Master!$D$1)-1, FALSE))","v":""},null,{"$f":"IF(A100 = \"\", \"\",VLOOKUP(A100,Master!$B$12:$T$78,COLUMN(Master!$S$1)-1, FALSE))","v":""},{"$f":"IF(A100 = \"\", \"\",VLOOKUP(A100,Master!$B$12:$T$78,COLUMN(Master!$T$1)-1, FALSE))","v":""}]
[null,{"$f":"IF(A101 = \"\", \"\",VLOOKUP(A101,Master!$B$12:$T$78,COLUMN(Master!$L$1)-1, FALSE))","v":""},{"$f":"IF(A101 = \"\", \"\",VLOOKUP(A101,Master!$B$12:$T$78,COLUMN(Master!$M$1)-1, FALSE))","v":""},{"$f":"IF(A101 = \"\", \"\",VLOOKUP(A101,Master!$B$12:$T$78,COLUMN(Master!$N$1)-1, FALSE))","v":""},{"$f":"IF(A101 = \"\", \"\",VLOOKUP(A101,Master!$B$12:$T$78,COLUMN(Master!$O$1)-1, FALSE))","v":""},{"$f":"IF(A101 = \"\", \"\",VLOOKUP(A101,Master!$B$12:$T$78,COLUMN(Master!$P$1)-1, FALSE))","v":""},{"$f":"IF(A101 = \"\", \"\",VLOOKUP(A101,Master!$B$12:$T$78,COLUMN(Master!$Q$1)-1, FALSE))","v":""},{"$f":"IF(A101 = \"\", \"\",VLOOKUP(A101,Master!$B$12:$T$78,COLUMN(Master!$R$1)-1, FALSE))","v":""},{"$f":"IF(A101 = \"\", \"\",VLOOKUP(A101,Master!$B$12:$T$78,COLUMN(Master!$C$1)-1, FALSE))","v":""},{"$f":"IF(A101 = \"\", \"\",VLOOKUP(A101,Master!$B$12:$T$78,COLUMN(Master!$D$1)-1, FALSE))","v":""},null,{"$f":"IF(A101 = \"\", \"\",VLOOKUP(A101,Master!$B$12:$T$78,COLUMN(Master!$S$1)-1, FALSE))","v":""},{"$f":"IF(A101 = \"\", \"\",VLOOKUP(A101,Master!$B$12:$T$78,COLUMN(Master!$T$1)-1, FALSE))","v":""}]
[null,{"$f":"IF(A102 = \"\", \"\",VLOOKUP(A102,Master!$B$12:$T$78,COLUMN(Master!$L$1)-1, FALSE))","v":""},{"$f":"IF(A102 = \"\", \"\",VLOOKUP(A102,Master!$B$12:$T$78,COLUMN(Master!$M$1)-1, FALSE))","v":""},{"$f":"IF(A102 = \"\", \"\",VLOOKUP(A102,Master!$B$12:$T$78,COLUMN(Master!$N$1)-1, FALSE))","v":""},{"$f":"IF(A102 = \"\", \"\",VLOOKUP(A102,Master!$B$12:$T$78,COLUMN(Master!$O$1)-1, FALSE))","v":""},{"$f":"IF(A102 = \"\", \"\",VLOOKUP(A102,Master!$B$12:$T$78,COLUMN(Master!$P$1)-1, FALSE))","v":""},{"$f":"IF(A102 = \"\", \"\",VLOOKUP(A102,Master!$B$12:$T$78,COLUMN(Master!$Q$1)-1, FALSE))","v":""},{"$f":"IF(A102 = \"\", \"\",VLOOKUP(A102,Master!$B$12:$T$78,COLUMN(Master!$R$1)-1, FALSE))","v":""},{"$f":"IF(A102 = \"\", \"\",VLOOKUP(A102,Master!$B$12:$T$78,COLUMN(Master!$C$1)-1, FALSE))","v":""},{"$f":"IF(A102 = \"\", \"\",VLOOKUP(A102,Master!$B$12:$T$78,COLUMN(Master!$D$1)-1, FALSE))","v":""},null,{"$f":"IF(A102 = \"\", \"\",VLOOKUP(A102,Master!$B$12:$T$78,COLUMN(Master!$S$1)-1, FALSE))","v":""},{"$f":"IF(A102 = \"\", \"\",VLOOKUP(A102,Master!$B$12:$T$78,COLUMN(Master!$T$1)-1, FALSE))","v":""}]
[null,{"$f":"IF(A103 = \"\", \"\",VLOOKUP(A103,Master!$B$12:$T$78,COLUMN(Master!$L$1)-1, FALSE))","v":""},{"$f":"IF(A103 = \"\", \"\",VLOOKUP(A103,Master!$B$12:$T$78,COLUMN(Master!$M$1)-1, FALSE))","v":""},{"$f":"IF(A103 = \"\", \"\",VLOOKUP(A103,Master!$B$12:$T$78,COLUMN(Master!$N$1)-1, FALSE))","v":""},{"$f":"IF(A103 = \"\", \"\",VLOOKUP(A103,Master!$B$12:$T$78,COLUMN(Master!$O$1)-1, FALSE))","v":""},{"$f":"IF(A103 = \"\", \"\",VLOOKUP(A103,Master!$B$12:$T$78,COLUMN(Master!$P$1)-1, FALSE))","v":""},{"$f":"IF(A103 = \"\", \"\",VLOOKUP(A103,Master!$B$12:$T$78,COLUMN(Master!$Q$1)-1, FALSE))","v":""},{"$f":"IF(A103 = \"\", \"\",VLOOKUP(A103,Master!$B$12:$T$78,COLUMN(Master!$R$1)-1, FALSE))","v":""},{"$f":"IF(A103 = \"\", \"\",VLOOKUP(A103,Master!$B$12:$T$78,COLUMN(Master!$C$1)-1, FALSE))","v":""},{"$f":"IF(A103 = \"\", \"\",VLOOKUP(A103,Master!$B$12:$T$78,COLUMN(Master!$D$1)-1, FALSE))","v":""},null,{"$f":"IF(A103 = \"\", \"\",VLOOKUP(A103,Master!$B$12:$T$78,COLUMN(Master!$S$1)-1, FALSE))","v":""},{"$f":"IF(A103 = \"\", \"\",VLOOKUP(A103,Master!$B$12:$T$78,COLUMN(Master!$T$1)-1, FALSE))","v":""}]
[null,{"$f":"IF(A104 = \"\", \"\",VLOOKUP(A104,Master!$B$12:$T$78,COLUMN(Master!$L$1)-1, FALSE))","v":""},{"$f":"IF(A104 = \"\", \"\",VLOOKUP(A104,Master!$B$12:$T$78,COLUMN(Master!$M$1)-1, FALSE))","v":""},{"$f":"IF(A104 = \"\", \"\",VLOOKUP(A104,Master!$B$12:$T$78,COLUMN(Master!$N$1)-1, FALSE))","v":""},{"$f":"IF(A104 = \"\", \"\",VLOOKUP(A104,Master!$B$12:$T$78,COLUMN(Master!$O$1)-1, FALSE))","v":""},{"$f":"IF(A104 = \"\", \"\",VLOOKUP(A104,Master!$B$12:$T$78,COLUMN(Master!$P$1)-1, FALSE))","v":""},{"$f":"IF(A104 = \"\", \"\",VLOOKUP(A104,Master!$B$12:$T$78,COLUMN(Master!$Q$1)-1, FALSE))","v":""},{"$f":"IF(A104 = \"\", \"\",VLOOKUP(A104,Master!$B$12:$T$78,COLUMN(Master!$R$1)-1, FALSE))","v":""},{"$f":"IF(A104 = \"\", \"\",VLOOKUP(A104,Master!$B$12:$T$78,COLUMN(Master!$C$1)-1, FALSE))","v":""},{"$f":"IF(A104 = \"\", \"\",VLOOKUP(A104,Master!$B$12:$T$78,COLUMN(Master!$D$1)-1, FALSE))","v":""},null,{"$f":"IF(A104 = \"\", \"\",VLOOKUP(A104,Master!$B$12:$T$78,COLUMN(Master!$S$1)-1, FALSE))","v":""},{"$f":"IF(A104 = \"\", \"\",VLOOKUP(A104,Master!$B$12:$T$78,COLUMN(Master!$T$1)-1, FALSE))","v":""}]
[null,{"$f":"IF(A105 = \"\", \"\",VLOOKUP(A105,Master!$B$12:$T$78,COLUMN(Master!$L$1)-1, FALSE))","v":""},{"$f":"IF(A105 = \"\", \"\",VLOOKUP(A105,Master!$B$12:$T$78,COLUMN(Master!$M$1)-1, FALSE))","v":""},{"$f":"IF(A105 = \"\", \"\",VLOOKUP(A105,Master!$B$12:$T$78,COLUMN(Master!$N$1)-1, FALSE))","v":""},{"$f":"IF(A105 = \"\", \"\",VLOOKUP(A105,Master!$B$12:$T$78,COLUMN(Master!$O$1)-1, FALSE))","v":""},{"$f":"IF(A105 = \"\", \"\",VLOOKUP(A105,Master!$B$12:$T$78,COLUMN(Master!$P$1)-1, FALSE))","v":""},{"$f":"IF(A105 = \"\", \"\",VLOOKUP(A105,Master!$B$12:$T$78,COLUMN(Master!$Q$1)-1, FALSE))","v":""},{"$f":"IF(A105 = \"\", \"\",VLOOKUP(A105,Master!$B$12:$T$78,COLUMN(Master!$R$1)-1, FALSE))","v":""},{"$f":"IF(A105 = \"\", \"\",VLOOKUP(A105,Master!$B$12:$T$78,COLUMN(Master!$C$1)-1, FALSE))","v":""},{"$f":"IF(A105 = \"\", \"\",VLOOKUP(A105,Master!$B$12:$T$78,COLUMN(Master!$D$1)-1, FALSE))","v":""},null,{"$f":"IF(A105 = \"\", \"\",VLOOKUP(A105,Master!$B$12:$T$78,COLUMN(Master!$S$1)-1, FALSE))","v":""},{"$f":"IF(A105 = \"\", \"\",VLOOKUP(A105,Master!$B$12:$T$78,COLUMN(Master!$T$1)-1, FALSE))","v":""}]
[null,{"$f":"IF(A106 = \"\", \"\",VLOOKUP(A106,Master!$B$12:$T$78,COLUMN(Master!$L$1)-1, FALSE))","v":""},{"$f":"IF(A106 = \"\", \"\",VLOOKUP(A106,Master!$B$12:$T$78,COLUMN(Master!$M$1)-1, FALSE))","v":""},{"$f":"IF(A106 = \"\", \"\",VLOOKUP(A106,Master!$B$12:$T$78,COLUMN(Master!$N$1)-1, FALSE))","v":""},{"$f":"IF(A106 = \"\", \"\",VLOOKUP(A106,Master!$B$12:$T$78,COLUMN(Master!$O$1)-1, FALSE))","v":""},{"$f":"IF(A106 = \"\", \"\",VLOOKUP(A106,Master!$B$12:$T$78,COLUMN(Master!$P$1)-1, FALSE))","v":""},{"$f":"IF(A106 = \"\", \"\",VLOOKUP(A106,Master!$B$12:$T$78,COLUMN(Master!$Q$1)-1, FALSE))","v":""},{"$f":"IF(A106 = \"\", \"\",VLOOKUP(A106,Master!$B$12:$T$78,COLUMN(Master!$R$1)-1, FALSE))","v":""},{"$f":"IF(A106 = \"\", \"\",VLOOKUP(A106,Master!$B$12:$T$78,COLUMN(Master!$C$1)-1, FALSE))","v":""},{"$f":"IF(A106 = \"\", \"\",VLOOKUP(A106,Master!$B$12:$T$78,COLUMN(Master!$D$1)-1, FALSE))","v":""},null,{"$f":"IF(A106 = \"\", \"\",VLOOKUP(A106,Master!$B$12:$T$78,COLUMN(Master!$S$1)-1, FALSE))","v":""},{"$f":"IF(A106 = \"\", \"\",VLOOKUP(A106,Master!$B$12:$T$78,COLUMN(Master!$T$1)-1, FALSE))","v":""}]
[null,{"$f":"IF(A107 = \"\", \"\",VLOOKUP(A107,Master!$B$12:$T$78,COLUMN(Master!$L$1)-1, FALSE))","v":""},{"$f":"IF(A107 = \"\", \"\",VLOOKUP(A107,Master!$B$12:$T$78,COLUMN(Master!$M$1)-1, FALSE))","v":""},{"$f":"IF(A107 = \"\", \"\",VLOOKUP(A107,Master!$B$12:$T$78,COLUMN(Master!$N$1)-1, FALSE))","v":""},{"$f":"IF(A107 = \"\", \"\",VLOOKUP(A107,Master!$B$12:$T$78,COLUMN(Master!$O$1)-1, FALSE))","v":""},{"$f":"IF(A107 = \"\", \"\",VLOOKUP(A107,Master!$B$12:$T$78,COLUMN(Master!$P$1)-1, FALSE))","v":""},{"$f":"IF(A107 = \"\", \"\",VLOOKUP(A107,Master!$B$12:$T$78,COLUMN(Master!$Q$1)-1, FALSE))","v":""},{"$f":"IF(A107 = \"\", \"\",VLOOKUP(A107,Master!$B$12:$T$78,COLUMN(Master!$R$1)-1, FALSE))","v":""},{"$f":"IF(A107 = \"\", \"\",VLOOKUP(A107,Master!$B$12:$T$78,COLUMN(Master!$C$1)-1, FALSE))","v":""},{"$f":"IF(A107 = \"\", \"\",VLOOKUP(A107,Master!$B$12:$T$78,COLUMN(Master!$D$1)-1, FALSE))","v":""},null,{"$f":"IF(A107 = \"\", \"\",VLOOKUP(A107,Master!$B$12:$T$78,COLUMN(Master!$S$1)-1, FALSE))","v":""},{"$f":"IF(A107 = \"\", \"\",VLOOKUP(A107,Master!$B$12:$T$78,COLUMN(Master!$T$1)-1, FALSE))","v":""}]
[null,{"$f":"IF(A108 = \"\", \"\",VLOOKUP(A108,Master!$B$12:$T$78,COLUMN(Master!$L$1)-1, FALSE))","v":""},{"$f":"IF(A108 = \"\", \"\",VLOOKUP(A108,Master!$B$12:$T$78,COLUMN(Master!$M$1)-1, FALSE))","v":""},{"$f":"IF(A108 = \"\", \"\",VLOOKUP(A108,Master!$B$12:$T$78,COLUMN(Master!$N$1)-1, FALSE))","v":""},{"$f":"IF(A108 = \"\", \"\",VLOOKUP(A108,Master!$B$12:$T$78,COLUMN(Master!$O$1)-1, FALSE))","v":""},{"$f":"IF(A108 = \"\", \"\",VLOOKUP(A108,Master!$B$12:$T$78,COLUMN(Master!$P$1)-1, FALSE))","v":""},{"$f":"IF(A108 = \"\", \"\",VLOOKUP(A108,Master!$B$12:$T$78,COLUMN(Master!$Q$1)-1, FALSE))","v":""},{"$f":"IF(A108 = \"\", \"\",VLOOKUP(A108,Master!$B$12:$T$78,COLUMN(Master!$R$1)-1, FALSE))","v":""},{"$f":"IF(A108 = \"\", \"\",VLOOKUP(A108,Master!$B$12:$T$78,COLUMN(Master!$C$1)-1, FALSE))","v":""},{"$f":"IF(A108 = \"\", \"\",VLOOKUP(A108,Master!$B$12:$T$78,COLUMN(Master!$D$1)-1, FALSE))","v":""},null,{"$f":"IF(A108 = \"\", \"\",VLOOKUP(A108,Master!$B$12:$T$78,COLUMN(Master!$S$1)-1, FALSE))","v":""},{"$f":"IF(A108 = \"\", \"\",VLOOKUP(A108,Master!$B$12:$T$78,COLUMN(Master!$T$1)-1, FALSE))","v":""}]
[null,{"$f":"IF(A109 = \"\", \"\",VLOOKUP(A109,Master!$B$12:$T$78,COLUMN(Master!$L$1)-1, FALSE))","v":""},{"$f":"IF(A109 = \"\", \"\",VLOOKUP(A109,Master!$B$12:$T$78,COLUMN(Master!$M$1)-1, FALSE))","v":""},{"$f":"IF(A109 = \"\", \"\",VLOOKUP(A109,Master!$B$12:$T$78,COLUMN(Master!$N$1)-1, FALSE))","v":""},{"$f":"IF(A109 = \"\", \"\",VLOOKUP(A109,Master!$B$12:$T$78,COLUMN(Master!$O$1)-1, FALSE))","v":""},{"$f":"IF(A109 = \"\", \"\",VLOOKUP(A109,Master!$B$12:$T$78,COLUMN(Master!$P$1)-1, FALSE))","v":""},{"$f":"IF(A109 = \"\", \"\",VLOOKUP(A109,Master!$B$12:$T$78,COLUMN(Master!$Q$1)-1, FALSE))","v":""},{"$f":"IF(A109 = \"\", \"\",VLOOKUP(A109,Master!$B$12:$T$78,COLUMN(Master!$R$1)-1, FALSE))","v":""},{"$f":"IF(A109 = \"\", \"\",VLOOKUP(A109,Master!$B$12:$T$78,COLUMN(Master!$C$1)-1, FALSE))","v":""},{"$f":"IF(A109 = \"\", \"\",VLOOKUP(A109,Master!$B$12:$T$78,COLUMN(Master!$D$1)-1, FALSE))","v":""},null,{"$f":"IF(A109 = \"\", \"\",VLOOKUP(A109,Master!$B$12:$T$78,COLUMN(Master!$S$1)-1, FALSE))","v":""},{"$f":"IF(A109 = \"\", \"\",VLOOKUP(A109,Master!$B$12:$T$78,COLUMN(Master!$T$1)-1, FALSE))","v":""}]
[null,{"$f":"IF(A110 = \"\", \"\",VLOOKUP(A110,Master!$B$12:$T$78,COLUMN(Master!$L$1)-1, FALSE))","v":""},{"$f":"IF(A110 = \"\", \"\",VLOOKUP(A110,Master!$B$12:$T$78,COLUMN(Master!$M$1)-1, FALSE))","v":""},{"$f":"IF(A110 = \"\", \"\",VLOOKUP(A110,Master!$B$12:$T$78,COLUMN(Master!$N$1)-1, FALSE))","v":""},{"$f":"IF(A110 = \"\", \"\",VLOOKUP(A110,Master!$B$12:$T$78,COLUMN(Master!$O$1)-1, FALSE))","v":""},{"$f":"IF(A110 = \"\", \"\",VLOOKUP(A110,Master!$B$12:$T$78,COLUMN(Master!$P$1)-1, FALSE))","v":""},{"$f":"IF(A110 = \"\", \"\",VLOOKUP(A110,Master!$B$12:$T$78,COLUMN(Master!$Q$1)-1, FALSE))","v":""},{"$f":"IF(A110 = \"\", \"\",VLOOKUP(A110,Master!$B$12:$T$78,COLUMN(Master!$R$1)-1, FALSE))","v":""},{"$f":"IF(A110 = \"\", \"\",VLOOKUP(A110,Master!$B$12:$T$78,COLUMN(Master!$C$1)-1, FALSE))","v":""},{"$f":"IF(A110 = \"\", \"\",VLOOKUP(A110,Master!$B$12:$T$78,COLUMN(Master!$D$1)-1, FALSE))","v":""},null,{"$f":"IF(A110 = \"\", \"\",VLOOKUP(A110,Master!$B$12:$T$78,COLUMN(Master!$S$1)-1, FALSE))","v":""},{"$f":"IF(A110 = \"\", \"\",VLOOKUP(A110,Master!$B$12:$T$78,COLUMN(Master!$T$1)-1, FALSE))","v":""}]
[null,{"$f":"IF(A111 = \"\", \"\",VLOOKUP(A111,Master!$B$12:$T$78,COLUMN(Master!$L$1)-1, FALSE))","v":""},{"$f":"IF(A111 = \"\", \"\",VLOOKUP(A111,Master!$B$12:$T$78,COLUMN(Master!$M$1)-1, FALSE))","v":""},{"$f":"IF(A111 = \"\", \"\",VLOOKUP(A111,Master!$B$12:$T$78,COLUMN(Master!$N$1)-1, FALSE))","v":""},{"$f":"IF(A111 = \"\", \"\",VLOOKUP(A111,Master!$B$12:$T$78,COLUMN(Master!$O$1)-1, FALSE))","v":""},{"$f":"IF(A111 = \"\", \"\",VLOOKUP(A111,Master!$B$12:$T$78,COLUMN(Master!$P$1)-1, FALSE))","v":""},{"$f":"IF(A111 = \"\", \"\",VLOOKUP(A111,Master!$B$12:$T$78,COLUMN(Master!$Q$1)-1, FALSE))","v":""},{"$f":"IF(A111 = \"\", \"\",VLOOKUP(A111,Master!$B$12:$T$78,COLUMN(Master!$R$1)-1, FALSE))","v":""},{"$f":"IF(A111 = \"\", \"\",VLOOKUP(A111,Master!$B$12:$T$78,COLUMN(Master!$C$1)-1, FALSE))","v":""},{"$f":"IF(A111 = \"\", \"\",VLOOKUP(A111,Master!$B$12:$T$78,COLUMN(Master!$D$1)-1, FALSE))","v":""},null,{"$f":"IF(A111 = \"\", \"\",VLOOKUP(A111,Master!$B$12:$T$78,COLUMN(Master!$S$1)-1, FALSE))","v":""},{"$f":"IF(A111 = \"\", \"\",VLOOKUP(A111,Master!$B$12:$T$78,COLUMN(Master!$T$1)-1, FALSE))","v":""}]
[null,{"$f":"IF(A112 = \"\", \"\",VLOOKUP(A112,Master!$B$12:$T$78,COLUMN(Master!$L$1)-1, FALSE))","v":""},{"$f":"IF(A112 = \"\", \"\",VLOOKUP(A112,Master!$B$12:$T$78,COLUMN(Master!$M$1)-1, FALSE))","v":""},{"$f":"IF(A112 = \"\", \"\",VLOOKUP(A112,Master!$B$12:$T$78,COLUMN(Master!$N$1)-1, FALSE))","v":""},{"$f":"IF(A112 = \"\", \"\",VLOOKUP(A112,Master!$B$12:$T$78,COLUMN(Master!$O$1)-1, FALSE))","v":""},{"$f":"IF(A112 = \"\", \"\",VLOOKUP(A112,Master!$B$12:$T$78,COLUMN(Master!$P$1)-1, FALSE))","v":""},{"$f":"IF(A112 = \"\", \"\",VLOOKUP(A112,Master!$B$12:$T$78,COLUMN(Master!$Q$1)-1, FALSE))","v":""},{"$f":"IF(A112 = \"\", \"\",VLOOKUP(A112,Master!$B$12:$T$78,COLUMN(Master!$R$1)-1, FALSE))","v":""},{"$f":"IF(A112 = \"\", \"\",VLOOKUP(A112,Master!$B$12:$T$78,COLUMN(Master!$C$1)-1, FALSE))","v":""},{"$f":"IF(A112 = \"\", \"\",VLOOKUP(A112,Master!$B$12:$T$78,COLUMN(Master!$D$1)-1, FALSE))","v":""},null,{"$f":"IF(A112 = \"\", \"\",VLOOKUP(A112,Master!$B$12:$T$78,COLUMN(Master!$S$1)-1, FALSE))","v":""},{"$f":"IF(A112 = \"\", \"\",VLOOKUP(A112,Master!$B$12:$T$78,COLUMN(Master!$T$1)-1, FALSE))","v":""}]
[null,{"$f":"IF(A113 = \"\", \"\",VLOOKUP(A113,Master!$B$12:$T$78,COLUMN(Master!$L$1)-1, FALSE))","v":""},{"$f":"IF(A113 = \"\", \"\",VLOOKUP(A113,Master!$B$12:$T$78,COLUMN(Master!$M$1)-1, FALSE))","v":""},{"$f":"IF(A113 = \"\", \"\",VLOOKUP(A113,Master!$B$12:$T$78,COLUMN(Master!$N$1)-1, FALSE))","v":""},{"$f":"IF(A113 = \"\", \"\",VLOOKUP(A113,Master!$B$12:$T$78,COLUMN(Master!$O$1)-1, FALSE))","v":""},{"$f":"IF(A113 = \"\", \"\",VLOOKUP(A113,Master!$B$12:$T$78,COLUMN(Master!$P$1)-1, FALSE))","v":""},{"$f":"IF(A113 = \"\", \"\",VLOOKUP(A113,Master!$B$12:$T$78,COLUMN(Master!$Q$1)-1, FALSE))","v":""},{"$f":"IF(A113 = \"\", \"\",VLOOKUP(A113,Master!$B$12:$T$78,COLUMN(Master!$R$1)-1, FALSE))","v":""},{"$f":"IF(A113 = \"\", \"\",VLOOKUP(A113,Master!$B$12:$T$78,COLUMN(Master!$C$1)-1, FALSE))","v":""},{"$f":"IF(A113 = \"\", \"\",VLOOKUP(A113,Master!$B$12:$T$78,COLUMN(Master!$D$1)-1, FALSE))","v":""},null,{"$f":"IF(A113 = \"\", \"\",VLOOKUP(A113,Master!$B$12:$T$78,COLUMN(Master!$S$1)-1, FALSE))","v":""},{"$f":"IF(A113 = \"\", \"\",VLOOKUP(A113,Master!$B$12:$T$78,COLUMN(Master!$T$1)-1, FALSE))","v":""}]
[null,{"$f":"IF(A114 = \"\", \"\",VLOOKUP(A114,Master!$B$12:$T$78,COLUMN(Master!$L$1)-1, FALSE))","v":""},{"$f":"IF(A114 = \"\", \"\",VLOOKUP(A114,Master!$B$12:$T$78,COLUMN(Master!$M$1)-1, FALSE))","v":""},{"$f":"IF(A114 = \"\", \"\",VLOOKUP(A114,Master!$B$12:$T$78,COLUMN(Master!$N$1)-1, FALSE))","v":""},{"$f":"IF(A114 = \"\", \"\",VLOOKUP(A114,Master!$B$12:$T$78,COLUMN(Master!$O$1)-1, FALSE))","v":""},{"$f":"IF(A114 = \"\", \"\",VLOOKUP(A114,Master!$B$12:$T$78,COLUMN(Master!$P$1)-1, FALSE))","v":""},{"$f":"IF(A114 = \"\", \"\",VLOOKUP(A114,Master!$B$12:$T$78,COLUMN(Master!$Q$1)-1, FALSE))","v":""},{"$f":"IF(A114 = \"\", \"\",VLOOKUP(A114,Master!$B$12:$T$78,COLUMN(Master!$R$1)-1, FALSE))","v":""},{"$f":"IF(A114 = \"\", \"\",VLOOKUP(A114,Master!$B$12:$T$78,COLUMN(Master!$C$1)-1, FALSE))","v":""},{"$f":"IF(A114 = \"\", \"\",VLOOKUP(A114,Master!$B$12:$T$78,COLUMN(Master!$D$1)-1, FALSE))","v":""},null,{"$f":"IF(A114 = \"\", \"\",VLOOKUP(A114,Master!$B$12:$T$78,COLUMN(Master!$S$1)-1, FALSE))","v":""},{"$f":"IF(A114 = \"\", \"\",VLOOKUP(A114,Master!$B$12:$T$78,COLUMN(Master!$T$1)-1, FALSE))","v":""}]
[null,{"$f":"IF(A115 = \"\", \"\",VLOOKUP(A115,Master!$B$12:$T$78,COLUMN(Master!$L$1)-1, FALSE))","v":""},{"$f":"IF(A115 = \"\", \"\",VLOOKUP(A115,Master!$B$12:$T$78,COLUMN(Master!$M$1)-1, FALSE))","v":""},{"$f":"IF(A115 = \"\", \"\",VLOOKUP(A115,Master!$B$12:$T$78,COLUMN(Master!$N$1)-1, FALSE))","v":""},{"$f":"IF(A115 = \"\", \"\",VLOOKUP(A115,Master!$B$12:$T$78,COLUMN(Master!$O$1)-1, FALSE))","v":""},{"$f":"IF(A115 = \"\", \"\",VLOOKUP(A115,Master!$B$12:$T$78,COLUMN(Master!$P$1)-1, FALSE))","v":""},{"$f":"IF(A115 = \"\", \"\",VLOOKUP(A115,Master!$B$12:$T$78,COLUMN(Master!$Q$1)-1, FALSE))","v":""},{"$f":"IF(A115 = \"\", \"\",VLOOKUP(A115,Master!$B$12:$T$78,COLUMN(Master!$R$1)-1, FALSE))","v":""},{"$f":"IF(A115 = \"\", \"\",VLOOKUP(A115,Master!$B$12:$T$78,COLUMN(Master!$C$1)-1, FALSE))","v":""},{"$f":"IF(A115 = \"\", \"\",VLOOKUP(A115,Master!$B$12:$T$78,COLUMN(Master!$D$1)-1, FALSE))","v":""},null,{"$f":"IF(A115 = \"\", \"\",VLOOKUP(A115,Master!$B$12:$T$78,COLUMN(Master!$S$1)-1, FALSE))","v":""},{"$f":"IF(A115 = \"\", \"\",VLOOKUP(A115,Master!$B$12:$T$78,COLUMN(Master!$T$1)-1, FALSE))","v":""}]
[null,{"$f":"IF(A116 = \"\", \"\",VLOOKUP(A116,Master!$B$12:$T$78,COLUMN(Master!$L$1)-1, FALSE))","v":""},{"$f":"IF(A116 = \"\", \"\",VLOOKUP(A116,Master!$B$12:$T$78,COLUMN(Master!$M$1)-1, FALSE))","v":""},{"$f":"IF(A116 = \"\", \"\",VLOOKUP(A116,Master!$B$12:$T$78,COLUMN(Master!$N$1)-1, FALSE))","v":""},{"$f":"IF(A116 = \"\", \"\",VLOOKUP(A116,Master!$B$12:$T$78,COLUMN(Master!$O$1)-1, FALSE))","v":""},{"$f":"IF(A116 = \"\", \"\",VLOOKUP(A116,Master!$B$12:$T$78,COLUMN(Master!$P$1)-1, FALSE))","v":""},{"$f":"IF(A116 = \"\", \"\",VLOOKUP(A116,Master!$B$12:$T$78,COLUMN(Master!$Q$1)-1, FALSE))","v":""},{"$f":"IF(A116 = \"\", \"\",VLOOKUP(A116,Master!$B$12:$T$78,COLUMN(Master!$R$1)-1, FALSE))","v":""},{"$f":"IF(A116 = \"\", \"\",VLOOKUP(A116,Master!$B$12:$T$78,COLUMN(Master!$C$1)-1, FALSE))","v":""},{"$f":"IF(A116 = \"\", \"\",VLOOKUP(A116,Master!$B$12:$T$78,COLUMN(Master!$D$1)-1, FALSE))","v":""},null,{"$f":"IF(A116 = \"\", \"\",VLOOKUP(A116,Master!$B$12:$T$78,COLUMN(Master!$S$1)-1, FALSE))","v":""},{"$f":"IF(A116 = \"\", \"\",VLOOKUP(A116,Master!$B$12:$T$78,COLUMN(Master!$T$1)-1, FALSE))","v":""}]
[null,{"$f":"IF(A117 = \"\", \"\",VLOOKUP(A117,Master!$B$12:$T$78,COLUMN(Master!$L$1)-1, FALSE))","v":""},{"$f":"IF(A117 = \"\", \"\",VLOOKUP(A117,Master!$B$12:$T$78,COLUMN(Master!$M$1)-1, FALSE))","v":""},{"$f":"IF(A117 = \"\", \"\",VLOOKUP(A117,Master!$B$12:$T$78,COLUMN(Master!$N$1)-1, FALSE))","v":""},{"$f":"IF(A117 = \"\", \"\",VLOOKUP(A117,Master!$B$12:$T$78,COLUMN(Master!$O$1)-1, FALSE))","v":""},{"$f":"IF(A117 = \"\", \"\",VLOOKUP(A117,Master!$B$12:$T$78,COLUMN(Master!$P$1)-1, FALSE))","v":""},{"$f":"IF(A117 = \"\", \"\",VLOOKUP(A117,Master!$B$12:$T$78,COLUMN(Master!$Q$1)-1, FALSE))","v":""},{"$f":"IF(A117 = \"\", \"\",VLOOKUP(A117,Master!$B$12:$T$78,COLUMN(Master!$R$1)-1, FALSE))","v":""},{"$f":"IF(A117 = \"\", \"\",VLOOKUP(A117,Master!$B$12:$T$78,COLUMN(Master!$C$1)-1, FALSE))","v":""},{"$f":"IF(A117 = \"\", \"\",VLOOKUP(A117,Master!$B$12:$T$78,COLUMN(Master!$D$1)-1, FALSE))","v":""},null,{"$f":"IF(A117 = \"\", \"\",VLOOKUP(A117,Master!$B$12:$T$78,COLUMN(Master!$S$1)-1, FALSE))","v":""},{"$f":"IF(A117 = \"\", \"\",VLOOKUP(A117,Master!$B$12:$T$78,COLUMN(Master!$T$1)-1, FALSE))","v":""}]
[null,{"$f":"IF(A118 = \"\", \"\",VLOOKUP(A118,Master!$B$12:$T$78,COLUMN(Master!$L$1)-1, FALSE))","v":""},{"$f":"IF(A118 = \"\", \"\",VLOOKUP(A118,Master!$B$12:$T$78,COLUMN(Master!$M$1)-1, FALSE))","v":""},{"$f":"IF(A118 = \"\", \"\",VLOOKUP(A118,Master!$B$12:$T$78,COLUMN(Master!$N$1)-1, FALSE))","v":""},{"$f":"IF(A118 = \"\", \"\",VLOOKUP(A118,Master!$B$12:$T$78,COLUMN(Master!$O$1)-1, FALSE))","v":""},{"$f":"IF(A118 = \"\", \"\",VLOOKUP(A118,Master!$B$12:$T$78,COLUMN(Master!$P$1)-1, FALSE))","v":""},{"$f":"IF(A118 = \"\", \"\",VLOOKUP(A118,Master!$B$12:$T$78,COLUMN(Master!$Q$1)-1, FALSE))","v":""},{"$f":"IF(A118 = \"\", \"\",VLOOKUP(A118,Master!$B$12:$T$78,COLUMN(Master!$R$1)-1, FALSE))","v":""},{"$f":"IF(A118 = \"\", \"\",VLOOKUP(A118,Master!$B$12:$T$78,COLUMN(Master!$C$1)-1, FALSE))","v":""},{"$f":"IF(A118 = \"\", \"\",VLOOKUP(A118,Master!$B$12:$T$78,COLUMN(Master!$D$1)-1, FALSE))","v":""},null,{"$f":"IF(A118 = \"\", \"\",VLOOKUP(A118,Master!$B$12:$T$78,COLUMN(Master!$S$1)-1, FALSE))","v":""},{"$f":"IF(A118 = \"\", \"\",VLOOKUP(A118,Master!$B$12:$T$78,COLUMN(Master!$T$1)-1, FALSE))","v":""}]
[null,{"$f":"IF(A119 = \"\", \"\",VLOOKUP(A119,Master!$B$12:$T$78,COLUMN(Master!$L$1)-1, FALSE))","v":""},{"$f":"IF(A119 = \"\", \"\",VLOOKUP(A119,Master!$B$12:$T$78,COLUMN(Master!$M$1)-1, FALSE))","v":""},{"$f":"IF(A119 = \"\", \"\",VLOOKUP(A119,Master!$B$12:$T$78,COLUMN(Master!$N$1)-1, FALSE))","v":""},{"$f":"IF(A119 = \"\", \"\",VLOOKUP(A119,Master!$B$12:$T$78,COLUMN(Master!$O$1)-1, FALSE))","v":""},{"$f":"IF(A119 = \"\", \"\",VLOOKUP(A119,Master!$B$12:$T$78,COLUMN(Master!$P$1)-1, FALSE))","v":""},{"$f":"IF(A119 = \"\", \"\",VLOOKUP(A119,Master!$B$12:$T$78,COLUMN(Master!$Q$1)-1, FALSE))","v":""},{"$f":"IF(A119 = \"\", \"\",VLOOKUP(A119,Master!$B$12:$T$78,COLUMN(Master!$R$1)-1, FALSE))","v":""},{"$f":"IF(A119 = \"\", \"\",VLOOKUP(A119,Master!$B$12:$T$78,COLUMN(Master!$C$1)-1, FALSE))","v":""},{"$f":"IF(A119 = \"\", \"\",VLOOKUP(A119,Master!$B$12:$T$78,COLUMN(Master!$D$1)-1, FALSE))","v":""},null,{"$f":"IF(A119 = \"\", \"\",VLOOKUP(A119,Master!$B$12:$T$78,COLUMN(Master!$S$1)-1, FALSE))","v":""},{"$f":"IF(A119 = \"\", \"\",VLOOKUP(A119,Master!$B$12:$T$78,COLUMN(Master!$T$1)-1, FALSE))","v":""}]
[null,{"$f":"IF(A120 = \"\", \"\",VLOOKUP(A120,Master!$B$12:$T$78,COLUMN(Master!$L$1)-1, FALSE))","v":""},{"$f":"IF(A120 = \"\", \"\",VLOOKUP(A120,Master!$B$12:$T$78,COLUMN(Master!$M$1)-1, FALSE))","v":""},{"$f":"IF(A120 = \"\", \"\",VLOOKUP(A120,Master!$B$12:$T$78,COLUMN(Master!$N$1)-1, FALSE))","v":""},{"$f":"IF(A120 = \"\", \"\",VLOOKUP(A120,Master!$B$12:$T$78,COLUMN(Master!$O$1)-1, FALSE))","v":""},{"$f":"IF(A120 = \"\", \"\",VLOOKUP(A120,Master!$B$12:$T$78,COLUMN(Master!$P$1)-1, FALSE))","v":""},{"$f":"IF(A120 = \"\", \"\",VLOOKUP(A120,Master!$B$12:$T$78,COLUMN(Master!$Q$1)-1, FALSE))","v":""},{"$f":"IF(A120 = \"\", \"\",VLOOKUP(A120,Master!$B$12:$T$78,COLUMN(Master!$R$1)-1, FALSE))","v":""},{"$f":"IF(A120 = \"\", \"\",VLOOKUP(A120,Master!$B$12:$T$78,COLUMN(Master!$C$1)-1, FALSE))","v":""},{"$f":"IF(A120 = \"\", \"\",VLOOKUP(A120,Master!$B$12:$T$78,COLUMN(Master!$D$1)-1, FALSE))","v":""},null,{"$f":"IF(A120 = \"\", \"\",VLOOKUP(A120,Master!$B$12:$T$78,COLUMN(Master!$S$1)-1, FALSE))","v":""},{"$f":"IF(A120 = \"\", \"\",VLOOKUP(A120,Master!$B$12:$T$78,COLUMN(Master!$T$1)-1, FALSE))","v":""}]
[null,{"$f":"IF(A121 = \"\", \"\",VLOOKUP(A121,Master!$B$12:$T$78,COLUMN(Master!$L$1)-1, FALSE))","v":""},{"$f":"IF(A121 = \"\", \"\",VLOOKUP(A121,Master!$B$12:$T$78,COLUMN(Master!$M$1)-1, FALSE))","v":""},{"$f":"IF(A121 = \"\", \"\",VLOOKUP(A121,Master!$B$12:$T$78,COLUMN(Master!$N$1)-1, FALSE))","v":""},{"$f":"IF(A121 = \"\", \"\",VLOOKUP(A121,Master!$B$12:$T$78,COLUMN(Master!$O$1)-1, FALSE))","v":""},{"$f":"IF(A121 = \"\", \"\",VLOOKUP(A121,Master!$B$12:$T$78,COLUMN(Master!$P$1)-1, FALSE))","v":""},{"$f":"IF(A121 = \"\", \"\",VLOOKUP(A121,Master!$B$12:$T$78,COLUMN(Master!$Q$1)-1, FALSE))","v":""},{"$f":"IF(A121 = \"\", \"\",VLOOKUP(A121,Master!$B$12:$T$78,COLUMN(Master!$R$1)-1, FALSE))","v":""},{"$f":"IF(A121 = \"\", \"\",VLOOKUP(A121,Master!$B$12:$T$78,COLUMN(Master!$C$1)-1, FALSE))","v":""},{"$f":"IF(A121 = \"\", \"\",VLOOKUP(A121,Master!$B$12:$T$78,COLUMN(Master!$D$1)-1, FALSE))","v":""},null,{"$f":"IF(A121 = \"\", \"\",VLOOKUP(A121,Master!$B$12:$T$78,COLUMN(Master!$S$1)-1, FALSE))","v":""},{"$f":"IF(A121 = \"\", \"\",VLOOKUP(A121,Master!$B$12:$T$78,COLUMN(Master!$T$1)-1, FALSE))","v":""}]

{"sheet":"Conveyance","index":5,"n_rows":123,"n_cols":9,"rows_kept":123,"cut":false,"hidden":false,"merged":[]}
["CONVEYANCE","If treatment is performed onsite, users will be directed to proceed to the Use and/or Disposal tab and bypass the Treatment tab.  "]
[]
[]
[]
[]
[]
[]
[]
[]
[]
[]
[]
[]
[]
[]
[]
[]
[]
[]
["Phase","Conveyance"]
["Removal system","(All)"]
["Technology","Removal method",{"$f":"Master!V1","v":"Availability"},{"$f":"Master!W1","v":"Proceed to"}]
["Container Based System",{"$f":"IF(A23=\"\",\"\",VLOOKUP(A23,Master!$B$79:$W$90,COLUMN(Master!$U$1)-1,FALSE))","v":"Container"},{"$f":"IF(A23=\"\",\"\",VLOOKUP(A23,Master!$B$79:$W$90,COLUMN(Master!$V$1)-1,FALSE))","v":"For purchase"},{"$f":"IF(A23=\"\",\"\",VLOOKUP(A23,Master!$B$79:$W$90,COLUMN(Master!$W$1)-1,FALSE))","v":"Treatment"}]
["Diaphragm Pump",{"$f":"IF(A24=\"\",\"\",VLOOKUP(A24,Master!$B$79:$W$90,COLUMN(Master!$U$1)-1,FALSE))","v":"Pump (both)"},{"$f":"IF(A24=\"\",\"\",VLOOKUP(A24,Master!$B$79:$W$90,COLUMN(Master!$V$1)-1,FALSE))","v":"For purchase"},{"$f":"IF(A24=\"\",\"\",VLOOKUP(A24,Master!$B$79:$W$90,COLUMN(Master!$W$1)-1,FALSE))","v":"Treatment"}]
["eVac (electric vacuum)",{"$f":"IF(A25=\"\",\"\",VLOOKUP(A25,Master!$B$79:$W$90,COLUMN(Master!$U$1)-1,FALSE))","v":"Pump (motorized)"},{"$f":"IF(A25=\"\",\"\",VLOOKUP(A25,Master!$B$79:$W$90,COLUMN(Master!$V$1)-1,FALSE))","v":"For purchase"},{"$f":"IF(A25=\"\",\"\",VLOOKUP(A25,Master!$B$79:$W$90,COLUMN(Master!$W$1)-1,FALSE))","v":"Treatment"}]
["Excrevator ",{"$f":"IF(A26=\"\",\"\",VLOOKUP(A26,Master!$B$79:$W$90,COLUMN(Master!$U$1)-1,FALSE))","v":"Pump (motorized)"},{"$f":"IF(A26=\"\",\"\",VLOOKUP(A26,Master!$B$79:$W$90,COLUMN(Master!$V$1)-1,FALSE))","v":"In development"},{"$f":"IF(A26=\"\",\"\",VLOOKUP(A26,Master!$B$79:$W$90,COLUMN(Master!$W$1)-1,FALSE))","v":"Treatment"}]
["Gulper / Extendable Gulper",{"$f":"IF(A27=\"\",\"\",VLOOKUP(A27,Master!$B$79:$W$90,COLUMN(Master!$U$1)-1,FALSE))","v":"Pump (manual)"},{"$f":"IF(A27=\"\",\"\",VLOOKUP(A27,Master!$B$79:$W$90,COLUMN(Master!$V$1)-1,FALSE))","v":"For purchase"},{"$f":"IF(A27=\"\",\"\",VLOOKUP(A27,Master!$B$79:$W$90,COLUMN(Master!$W$1)-1,FALSE))","v":"Treatment"}]
["Hand tools and personal protective equipment ",{"$f":"IF(A28=\"\",\"\",VLOOKUP(A28,Master!$B$79:$W$90,COLUMN(Master!$U$1)-1,FALSE))","v":"Manual"},{"$f":"IF(A28=\"\",\"\",VLOOKUP(A28,Master!$B$79:$W$90,COLUMN(Master!$V$1)-1,FALSE))","v":"For purchase"},{"$f":"IF(A28=\"\",\"\",VLOOKUP(A28,Master!$B$79:$W$90,COLUMN(Master!$W$1)-1,FALSE))","v":"Treatment"}]
["Manual Pump (Omni-Ingestor)",{"$f":"IF(A29=\"\",\"\",VLOOKUP(A29,Master!$B$79:$W$90,COLUMN(Master!$U$1)-1,FALSE))","v":"Pump (manual)"},{"$f":"IF(A29=\"\",\"\",VLOOKUP(A29,Master!$B$79:$W$90,COLUMN(Master!$V$1)-1,FALSE))","v":"In development"},{"$f":"IF(A29=\"\",\"\",VLOOKUP(A29,Master!$B$79:$W$90,COLUMN(Master!$W$1)-1,FALSE))","v":"Treatment"}]
["Pit Screw Auger",{"$f":"IF(A30=\"\",\"\",VLOOKUP(A30,Master!$B$79:$W$90,COLUMN(Master!$U$1)-1,FALSE))","v":"Pump (motorized)"},{"$f":"IF(A30=\"\",\"\",VLOOKUP(A30,Master!$B$79:$W$90,COLUMN(Master!$V$1)-1,FALSE))","v":"For purchase"},{"$f":"IF(A30=\"\",\"\",VLOOKUP(A30,Master!$B$79:$W$90,COLUMN(Master!$W$1)-1,FALSE))","v":"Treatment"}]
["Poo Pump",{"$f":"IF(A31=\"\",\"\",VLOOKUP(A31,Master!$B$79:$W$90,COLUMN(Master!$U$1)-1,FALSE))","v":"Pump (manual)"},{"$f":"IF(A31=\"\",\"\",VLOOKUP(A31,Master!$B$79:$W$90,COLUMN(Master!$V$1)-1,FALSE))","v":"For purchase"},{"$f":"IF(A31=\"\",\"\",VLOOKUP(A31,Master!$B$79:$W$90,COLUMN(Master!$W$1)-1,FALSE))","v":"Treatment"}]
["Sewer system (simplified, solids-free, conventional)",{"$f":"IF(A32=\"\",\"\",VLOOKUP(A32,Master!$B$79:$W$90,COLUMN(Master!$U$1)-1,FALSE))","v":"Pipe"},{"$f":"IF(A32=\"\",\"\",VLOOKUP(A32,Master!$B$79:$W$90,COLUMN(Master!$V$1)-1,FALSE))","v":"Open source "},{"$f":"IF(A32=\"\",\"\",VLOOKUP(A32,Master!$B$79:$W$90,COLUMN(Master!$W$1)-1,FALSE))","v":"Treatment"}]
["Sludge Digger",{"$f":"IF(A33=\"\",\"\",VLOOKUP(A33,Master!$B$79:$W$90,COLUMN(Master!$U$1)-1,FALSE))","v":"Manual"},{"$f":"IF(A33=\"\",\"\",VLOOKUP(A33,Master!$B$79:$W$90,COLUMN(Master!$V$1)-1,FALSE))","v":"In development"},{"$f":"IF(A33=\"\",\"\",VLOOKUP(A33,Master!$B$79:$W$90,COLUMN(Master!$W$1)-1,FALSE))","v":"Treatment"}]
["Vacuum truck",{"$f":"IF(A34=\"\",\"\",VLOOKUP(A34,Master!$B$79:$W$90,COLUMN(Master!$U$1)-1,FALSE))","v":"Pump (motorized)"},{"$f":"IF(A34=\"\",\"\",VLOOKUP(A34,Master!$B$79:$W$90,COLUMN(Master!$V$1)-1,FALSE))","v":"For purchase"},{"$f":"IF(A34=\"\",\"\",VLOOKUP(A34,Master!$B$79:$W$90,COLUMN(Master!$W$1)-1,FALSE))","v":"Treatment"}]
[null,null,{"$f":"IF(A35=\"\",\"\",VLOOKUP(A35,Master!$B$79:$W$90,COLUMN(Master!$V$1)-1,FALSE))","v":""},{"$f":"IF(A35=\"\",\"\",VLOOKUP(A35,Master!$B$79:$W$90,COLUMN(Master!$W$1)-1,FALSE))","v":""}]
[null,null,{"$f":"IF(A36=\"\",\"\",VLOOKUP(A36,Master!$B$79:$W$90,COLUMN(Master!$V$1)-1,FALSE))","v":""},{"$f":"IF(A36=\"\",\"\",VLOOKUP(A36,Master!$B$79:$W$90,COLUMN(Master!$W$1)-1,FALSE))","v":""}]
[null,null,{"$f":"IF(A37=\"\",\"\",VLOOKUP(A37,Master!$B$79:$W$90,COLUMN(Master!$V$1)-1,FALSE))","v":""},{"$f":"IF(A37=\"\",\"\",VLOOKUP(A37,Master!$B$79:$W$90,COLUMN(Master!$W$1)-1,FALSE))","v":""}]
[null,null,{"$f":"IF(A38=\"\",\"\",VLOOKUP(A38,Master!$B$79:$W$90,COLUMN(Master!$V$1)-1,FALSE))","v":""},{"$f":"IF(A38=\"\",\"\",VLOOKUP(A38,Master!$B$79:$W$90,COLUMN(Master!$W$1)-1,FALSE))","v":""}]
[null,null,{"$f":"IF(A39=\"\",\"\",VLOOKUP(A39,Master!$B$79:$W$90,COLUMN(Master!$V$1)-1,FALSE))","v":""},{"$f":"IF(A39=\"\",\"\",VLOOKUP(A39,Master!$B$79:$W$90,COLUMN(Master!$W$1)-1,FALSE))","v":""}]
[null,null,{"$f":"IF(A40=\"\",\"\",VLOOKUP(A40,Master!$B$79:$W$90,COLUMN(Master!$V$1)-1,FALSE))","v":""},{"$f":"IF(A40=\"\",\"\",VLOOKUP(A40,Master!$B$79:$W$90,COLUMN(Master!$W$1)-1,FALSE))","v":""}]
[null,null,{"$f":"IF(A41=\"\",\"\",VLOOKUP(A41,Master!$B$79:$W$90,COLUMN(Master!$V$1)-1,FALSE))","v":""},{"$f":"IF(A41=\"\",\"\",VLOOKUP(A41,Master!$B$79:$W$90,COLUMN(Master!$W$1)-1,FALSE))","v":""}]
[null,null,{"$f":"IF(A42=\"\",\"\",VLOOKUP(A42,Master!$B$79:$W$90,COLUMN(Master!$V$1)-1,FALSE))","v":""},{"$f":"IF(A42=\"\",\"\",VLOOKUP(A42,Master!$B$79:$W$90,COLUMN(Master!$W$1)-1,FALSE))","v":""}]
[null,null,{"$f":"IF(A43=\"\",\"\",VLOOKUP(A43,Master!$B$79:$W$90,COLUMN(Master!$V$1)-1,FALSE))","v":""},{"$f":"IF(A43=\"\",\"\",VLOOKUP(A43,Master!$B$79:$W$90,COLUMN(Master!$W$1)-1,FALSE))","v":""}]
[null,null,{"$f":"IF(A44=\"\",\"\",VLOOKUP(A44,Master!$B$79:$W$90,COLUMN(Master!$V$1)-1,FALSE))","v":""},{"$f":"IF(A44=\"\",\"\",VLOOKUP(A44,Master!$B$79:$W$90,COLUMN(Master!$W$1)-1,FALSE))","v":""}]
[null,null,{"$f":"IF(A45=\"\",\"\",VLOOKUP(A45,Master!$B$79:$W$90,COLUMN(Master!$V$1)-1,FALSE))","v":""},{"$f":"IF(A45=\"\",\"\",VLOOKUP(A45,Master!$B$79:$W$90,COLUMN(Master!$W$1)-1,FALSE))","v":""}]
[null,null,{"$f":"IF(A46=\"\",\"\",VLOOKUP(A46,Master!$B$79:$W$90,COLUMN(Master!$V$1)-1,FALSE))","v":""},{"$f":"IF(A46=\"\",\"\",VLOOKUP(A46,Master!$B$79:$W$90,COLUMN(Master!$W$1)-1,FALSE))","v":""}]
[null,{"$f":"IF(A47=\"\",\"\",VLOOKUP(A47,Master!$B$79:$W$90,COLUMN(Master!#REF!)-1,FALSE))","v":""},null,{"$f":"IF(A47=\"\",\"\",VLOOKUP(A47,Master!$B$79:$W$90,COLUMN(Master!$V$1)-1,FALSE))","v":""},{"$f":"IF(A47=\"\",\"\",VLOOKUP(A47,Master!$B$79:$W$90,COLUMN(Master!$W$1)-1,FALSE))","v":""}]
[]
[]
[]
[null,{"$f":"IF(A51 = \"\", \"\",VLOOKUP(A51,Master!$B$12:$T$78,2, FALSE))","v":""},null,{"$f":"IF(A51 = \"\", \"\",VLOOKUP(A51,Master!$B$12:$T$78,11, FALSE))","v":""},{"$f":"IF(A51 = \"\", \"\",VLOOKUP(A51,Master!$B$12:$T$78,12, FALSE))","v":""},{"$f":"IF(A51 = \"\", \"\",VLOOKUP(A51,Master!$B$12:$T$78,13, FALSE))","v":""},{"$f":"IF(A51 = \"\", \"\",VLOOKUP(A51,Master!$B$12:$T$78,14, FALSE))","v":""},{"$f":"IF(A51 = \"\", \"\",VLOOKUP(A51,Master!$B$12:$T$78,15, FALSE))","v":""},{"$f":"IF(A51 = \"\", \"\",VLOOKUP(A51,Master!$B$12:$T$78,16, FALSE))","v":""}]
[null,{"$f":"IF(A52 = \"\", \"\",VLOOKUP(A52,Master!$B$12:$T$78,2, FALSE))","v":""},null,{"$f":"IF(A52 = \"\", \"\",VLOOKUP(A52,Master!$B$12:$T$78,11, FALSE))","v":""},{"$f":"IF(A52 = \"\", \"\",VLOOKUP(A52,Master!$B$12:$T$78,12, FALSE))","v":""},{"$f":"IF(A52 = \"\", \"\",VLOOKUP(A52,Master!$B$12:$T$78,13, FALSE))","v":""},{"$f":"IF(A52 = \"\", \"\",VLOOKUP(A52,Master!$B$12:$T$78,14, FALSE))","v":""},{"$f":"IF(A52 = \"\", \"\",VLOOKUP(A52,Master!$B$12:$T$78,15, FALSE))","v":""},{"$f":"IF(A52 = \"\", \"\",VLOOKUP(A52,Master!$B$12:$T$78,16, FALSE))","v":""}]
[null,{"$f":"IF(A53 = \"\", \"\",VLOOKUP(A53,Master!$B$12:$T$78,2, FALSE))","v":""},null,{"$f":"IF(A53 = \"\", \"\",VLOOKUP(A53,Master!$B$12:$T$78,11, FALSE))","v":""},{"$f":"IF(A53 = \"\", \"\",VLOOKUP(A53,Master!$B$12:$T$78,12, FALSE))","v":""},{"$f":"IF(A53 = \"\", \"\",VLOOKUP(A53,Master!$B$12:$T$78,13, FALSE))","v":""},{"$f":"IF(A53 = \"\", \"\",VLOOKUP(A53,Master!$B$12:$T$78,14, FALSE))","v":""},{"$f":"IF(A53 = \"\", \"\",VLOOKUP(A53,Master!$B$12:$T$78,15, FALSE))","v":""},{"$f":"IF(A53 = \"\", \"\",VLOOKUP(A53,Master!$B$12:$T$78,16, FALSE))","v":""}]
[null,{"$f":"IF(A54 = \"\", \"\",VLOOKUP(A54,Master!$B$12:$T$78,2, FALSE))","v":""},null,{"$f":"IF(A54 = \"\", \"\",VLOOKUP(A54,Master!$B$12:$T$78,11, FALSE))","v":""},{"$f":"IF(A54 = \"\", \"\",VLOOKUP(A54,Master!$B$12:$T$78,12, FALSE))","v":""},{"$f":"IF(A54 = \"\", \"\",VLOOKUP(A54,Master!$B$12:$T$78,13, FALSE))","v":""},{"$f":"IF(A54 = \"\", \"\",VLOOKUP(A54,Master!$B$12:$T$78,14, FALSE))","v":""},{"$f":"IF(A54 = \"\", \"\",VLOOKUP(A54,Master!$B$12:$T$78,15, FALSE))","v":""},{"$f":"IF(A54 = \"\", \"\",VLOOKUP(A54,Master!$B$12:$T$78,16, FALSE))","v":""}]
[null,{"$f":"IF(A55 = \"\", \"\",VLOOKUP(A55,Master!$B$12:$T$78,2, FALSE))","v":""},null,{"$f":"IF(A55 = \"\", \"\",VLOOKUP(A55,Master!$B$12:$T$78,11, FALSE))","v":""},{"$f":"IF(A55 = \"\", \"\",VLOOKUP(A55,Master!$B$12:$T$78,12, FALSE))","v":""},{"$f":"IF(A55 = \"\", \"\",VLOOKUP(A55,Master!$B$12:$T$78,13, FALSE))","v":""},{"$f":"IF(A55 = \"\", \"\",VLOOKUP(A55,Master!$B$12:$T$78,14, FALSE))","v":""},{"$f":"IF(A55 = \"\", \"\",VLOOKUP(A55,Master!$B$12:$T$78,15, FALSE))","v":""},{"$f":"IF(A55 = \"\", \"\",VLOOKUP(A55,Master!$B$12:$T$78,16, FALSE))","v":""}]
[null,{"$f":"IF(A56 = \"\", \"\",VLOOKUP(A56,Master!$B$12:$T$78,2, FALSE))","v":""},null,{"$f":"IF(A56 = \"\", \"\",VLOOKUP(A56,Master!$B$12:$T$78,11, FALSE))","v":""},{"$f":"IF(A56 = \"\", \"\",VLOOKUP(A56,Master!$B$12:$T$78,12, FALSE))","v":""},{"$f":"IF(A56 = \"\", \"\",VLOOKUP(A56,Master!$B$12:$T$78,13, FALSE))","v":""},{"$f":"IF(A56 = \"\", \"\",VLOOKUP(A56,Master!$B$12:$T$78,14, FALSE))","v":""},{"$f":"IF(A56 = \"\", \"\",VLOOKUP(A56,Master!$B$12:$T$78,15, FALSE))","v":""},{"$f":"IF(A56 = \"\", \"\",VLOOKUP(A56,Master!$B$12:$T$78,16, FALSE))","v":""}]
[null,{"$f":"IF(A57 = \"\", \"\",VLOOKUP(A57,Master!$B$12:$T$78,2, FALSE))","v":""},null,{"$f":"IF(A57 = \"\", \"\",VLOOKUP(A57,Master!$B$12:$T$78,11, FALSE))","v":""},{"$f":"IF(A57 = \"\", \"\",VLOOKUP(A57,Master!$B$12:$T$78,12, FALSE))","v":""},{"$f":"IF(A57 = \"\", \"\",VLOOKUP(A57,Master!$B$12:$T$78,13, FALSE))","v":""},{"$f":"IF(A57 = \"\", \"\",VLOOKUP(A57,Master!$B$12:$T$78,14, FALSE))","v":""},{"$f":"IF(A57 = \"\", \"\",VLOOKUP(A57,Master!$B$12:$T$78,15, FALSE))","v":""},{"$f":"IF(A57 = \"\", \"\",VLOOKUP(A57,Master!$B$12:$T$78,16, FALSE))","v":""}]
[null,{"$f":"IF(A58 = \"\", \"\",VLOOKUP(A58,Master!$B$12:$T$78,2, FALSE))","v":""},null,{"$f":"IF(A58 = \"\", \"\",VLOOKUP(A58,Master!$B$12:$T$78,11, FALSE))","v":""},{"$f":"IF(A58 = \"\", \"\",VLOOKUP(A58,Master!$B$12:$T$78,12, FALSE))","v":""},{"$f":"IF(A58 = \"\", \"\",VLOOKUP(A58,Master!$B$12:$T$78,13, FALSE))","v":""},{"$f":"IF(A58 = \"\", \"\",VLOOKUP(A58,Master!$B$12:$T$78,14, FALSE))","v":""},{"$f":"IF(A58 = \"\", \"\",VLOOKUP(A58,Master!$B$12:$T$78,15, FALSE))","v":""},{"$f":"IF(A58 = \"\", \"\",VLOOKUP(A58,Master!$B$12:$T$78,16, FALSE))","v":""}]
[null,{"$f":"IF(A59 = \"\", \"\",VLOOKUP(A59,Master!$B$12:$T$78,2, FALSE))","v":""},null,{"$f":"IF(A59 = \"\", \"\",VLOOKUP(A59,Master!$B$12:$T$78,11, FALSE))","v":""},{"$f":"IF(A59 = \"\", \"\",VLOOKUP(A59,Master!$B$12:$T$78,12, FALSE))","v":""},{"$f":"IF(A59 = \"\", \"\",VLOOKUP(A59,Master!$B$12:$T$78,13, FALSE))","v":""},{"$f":"IF(A59 = \"\", \"\",VLOOKUP(A59,Master!$B$12:$T$78,14, FALSE))","v":""},{"$f":"IF(A59 = \"\", \"\",VLOOKUP(A59,Master!$B$12:$T$78,15, FALSE))","v":""},{"$f":"IF(A59 = \"\", \"\",VLOOKUP(A59,Master!$B$12:$T$78,16, FALSE))","v":""}]
[null,{"$f":"IF(A60 = \"\", \"\",VLOOKUP(A60,Master!$B$12:$T$78,2, FALSE))","v":""},null,{"$f":"IF(A60 = \"\", \"\",VLOOKUP(A60,Master!$B$12:$T$78,11, FALSE))","v":""},{"$f":"IF(A60 = \"\", \"\",VLOOKUP(A60,Master!$B$12:$T$78,12, FALSE))","v":""},{"$f":"IF(A60 = \"\", \"\",VLOOKUP(A60,Master!$B$12:$T$78,13, FALSE))","v":""},{"$f":"IF(A60 = \"\", \"\",VLOOKUP(A60,Master!$B$12:$T$78,14, FALSE))","v":""},{"$f":"IF(A60 = \"\", \"\",VLOOKUP(A60,Master!$B$12:$T$78,15, FALSE))","v":""},{"$f":"IF(A60 = \"\", \"\",VLOOKUP(A60,Master!$B$12:$T$78,16, FALSE))","v":""}]
[null,{"$f":"IF(A61 = \"\", \"\",VLOOKUP(A61,Master!$B$12:$T$78,2, FALSE))","v":""},null,{"$f":"IF(A61 = \"\", \"\",VLOOKUP(A61,Master!$B$12:$T$78,11, FALSE))","v":""},{"$f":"IF(A61 = \"\", \"\",VLOOKUP(A61,Master!$B$12:$T$78,12, FALSE))","v":""},{"$f":"IF(A61 = \"\", \"\",VLOOKUP(A61,Master!$B$12:$T$78,13, FALSE))","v":""},{"$f":"IF(A61 = \"\", \"\",VLOOKUP(A61,Master!$B$12:$T$78,14, FALSE))","v":""},{"$f":"IF(A61 = \"\", \"\",VLOOKUP(A61,Master!$B$12:$T$78,15, FALSE))","v":""},{"$f":"IF(A61 = \"\", \"\",VLOOKUP(A61,Master!$B$12:$T$78,16, FALSE))","v":""}]
[null,{"$f":"IF(A62 = \"\", \"\",VLOOKUP(A62,Master!$B$12:$T$78,2, FALSE))","v":""},null,{"$f":"IF(A62 = \"\", \"\",VLOOKUP(A62,Master!$B$12:$T$78,11, FALSE))","v":""},{"$f":"IF(A62 = \"\", \"\",VLOOKUP(A62,Master!$B$12:$T$78,12, FALSE))","v":""},{"$f":"IF(A62 = \"\", \"\",VLOOKUP(A62,Master!$B$12:$T$78,13, FALSE))","v":""},{"$f":"IF(A62 = \"\", \"\",VLOOKUP(A62,Master!$B$12:$T$78,14, FALSE))","v":""},{"$f":"IF(A62 = \"\", \"\",VLOOKUP(A62,Master!$B$12:$T$78,15, FALSE))","v":""},{"$f":"IF(A62 = \"\", \"\",VLOOKUP(A62,Master!$B$12:$T$78,16, FALSE))","v":""}]
[null,{"$f":"IF(A63 = \"\", \"\",VLOOKUP(A63,Master!$B$12:$T$78,2, FALSE))","v":""},null,{"$f":"IF(A63 = \"\", \"\",VLOOKUP(A63,Master!$B$12:$T$78,11, FALSE))","v":""},{"$f":"IF(A63 = \"\", \"\",VLOOKUP(A63,Master!$B$12:$T$78,12, FALSE))","v":""},{"$f":"IF(A63 = \"\", \"\",VLOOKUP(A63,Master!$B$12:$T$78,13, FALSE))","v":""},{"$f":"IF(A63 = \"\", \"\",VLOOKUP(A63,Master!$B$12:$T$78,14, FALSE))","v":""},{"$f":"IF(A63 = \"\", \"\",VLOOKUP(A63,Master!$B$12:$T$78,15, FALSE))","v":""},{"$f":"IF(A63 = \"\", \"\",VLOOKUP(A63,Master!$B$12:$T$78,16, FALSE))","v":""}]
[null,{"$f":"IF(A64 = \"\", \"\",VLOOKUP(A64,Master!$B$12:$T$78,2, FALSE))","v":""},null,{"$f":"IF(A64 = \"\", \"\",VLOOKUP(A64,Master!$B$12:$T$78,11, FALSE))","v":""},{"$f":"IF(A64 = \"\", \"\",VLOOKUP(A64,Master!$B$12:$T$78,12, FALSE))","v":""},{"$f":"IF(A64 = \"\", \"\",VLOOKUP(A64,Master!$B$12:$T$78,13, FALSE))","v":""},{"$f":"IF(A64 = \"\", \"\",VLOOKUP(A64,Master!$B$12:$T$78,14, FALSE))","v":""},{"$f":"IF(A64 = \"\", \"\",VLOOKUP(A64,Master!$B$12:$T$78,15, FALSE))","v":""},{"$f":"IF(A64 = \"\", \"\",VLOOKUP(A64,Master!$B$12:$T$78,16, FALSE))","v":""}]
[null,{"$f":"IF(A65 = \"\", \"\",VLOOKUP(A65,Master!$B$12:$T$78,2, FALSE))","v":""},null,{"$f":"IF(A65 = \"\", \"\",VLOOKUP(A65,Master!$B$12:$T$78,11, FALSE))","v":""},{"$f":"IF(A65 = \"\", \"\",VLOOKUP(A65,Master!$B$12:$T$78,12, FALSE))","v":""},{"$f":"IF(A65 = \"\", \"\",VLOOKUP(A65,Master!$B$12:$T$78,13, FALSE))","v":""},{"$f":"IF(A65 = \"\", \"\",VLOOKUP(A65,Master!$B$12:$T$78,14, FALSE))","v":""},{"$f":"IF(A65 = \"\", \"\",VLOOKUP(A65,Master!$B$12:$T$78,15, FALSE))","v":""},{"$f":"IF(A65 = \"\", \"\",VLOOKUP(A65,Master!$B$12:$T$78,16, FALSE))","v":""}]
[null,{"$f":"IF(A66 = \"\", \"\",VLOOKUP(A66,Master!$B$12:$T$78,2, FALSE))","v":""},null,{"$f":"IF(A66 = \"\", \"\",VLOOKUP(A66,Master!$B$12:$T$78,11, FALSE))","v":""},{"$f":"IF(A66 = \"\", \"\",VLOOKUP(A66,Master!$B$12:$T$78,12, FALSE))","v":""},{"$f":"IF(A66 = \"\", \"\",VLOOKUP(A66,Master!$B$12:$T$78,13, FALSE))","v":""},{"$f":"IF(A66 = \"\", \"\",VLOOKUP(A66,Master!$B$12:$T$78,14, FALSE))","v":""},{"$f":"IF(A66 = \"\", \"\",VLOOKUP(A66,Master!$B$12:$T$78,15, FALSE))","v":""},{"$f":"IF(A66 = \"\", \"\",VLOOKUP(A66,Master!$B$12:$T$78,16, FALSE))","v":""}]
[null,{"$f":"IF(A67 = \"\", \"\",VLOOKUP(A67,Master!$B$12:$T$78,2, FALSE))","v":""},null,{"$f":"IF(A67 = \"\", \"\",VLOOKUP(A67,Master!$B$12:$T$78,11, FALSE))","v":""},{"$f":"IF(A67 = \"\", \"\",VLOOKUP(A67,Master!$B$12:$T$78,12, FALSE))","v":""},{"$f":"IF(A67 = \"\", \"\",VLOOKUP(A67,Master!$B$12:$T$78,13, FALSE))","v":""},{"$f":"IF(A67 = \"\", \"\",VLOOKUP(A67,Master!$B$12:$T$78,14, FALSE))","v":""},{"$f":"IF(A67 = \"\", \"\",VLOOKUP(A67,Master!$B$12:$T$78,15, FALSE))","v":""},{"$f":"IF(A67 = \"\", \"\",VLOOKUP(A67,Master!$B$12:$T$78,16, FALSE))","v":""}]
[null,{"$f":"IF(A68 = \"\", \"\",VLOOKUP(A68,Master!$B$12:$T$78,2, FALSE))","v":""},null,{"$f":"IF(A68 = \"\", \"\",VLOOKUP(A68,Master!$B$12:$T$78,11, FALSE))","v":""},{"$f":"IF(A68 = \"\", \"\",VLOOKUP(A68,Master!$B$12:$T$78,12, FALSE))","v":""},{"$f":"IF(A68 = \"\", \"\",VLOOKUP(A68,Master!$B$12:$T$78,13, FALSE))","v":""},{"$f":"IF(A68 = \"\", \"\",VLOOKUP(A68,Master!$B$12:$T$78,14, FALSE))","v":""},{"$f":"IF(A68 = \"\", \"\",VLOOKUP(A68,Master!$B$12:$T$78,15, FALSE))","v":""},{"$f":"IF(A68 = \"\", \"\",VLOOKUP(A68,Master!$B$12:$T$78,16, FALSE))","v":""}]
[null,{"$f":"IF(A69 = \"\", \"\",VLOOKUP(A69,Master!$B$12:$T$78,2, FALSE))","v":""},null,{"$f":"IF(A69 = \"\", \"\",VLOOKUP(A69,Master!$B$12:$T$78,11, FALSE))","v":""},{"$f":"IF(A69 = \"\", \"\",VLOOKUP(A69,Master!$B$12:$T$78,12, FALSE))","v":""},{"$f":"IF(A69 = \"\", \"\",VLOOKUP(A69,Master!$B$12:$T$78,13, FALSE))","v":""},{"$f":"IF(A69 = \"\", \"\",VLOOKUP(A69,Master!$B$12:$T$78,14, FALSE))","v":""},{"$f":"IF(A69 = \"\", \"\",VLOOKUP(A69,Master!$B$12:$T$78,15, FALSE))","v":""},{"$f":"IF(A69 = \"\", \"\",VLOOKUP(A69,Master!$B$12:$T$78,16, FALSE))","v":""}]
[null,{"$f":"IF(A70 = \"\", \"\",VLOOKUP(A70,Master!$B$12:$T$78,2, FALSE))","v":""},null,{"$f":"IF(A70 = \"\", \"\",VLOOKUP(A70,Master!$B$12:$T$78,11, FALSE))","v":""},{"$f":"IF(A70 = \"\", \"\",VLOOKUP(A70,Master!$B$12:$T$78,12, FALSE))","v":""},{"$f":"IF(A70 = \"\", \"\",VLOOKUP(A70,Master!$B$12:$T$78,13, FALSE))","v":""},{"$f":"IF(A70 = \"\", \"\",VLOOKUP(A70,Master!$B$12:$T$78,14, FALSE))","v":""},{"$f":"IF(A70 = \"\", \"\",VLOOKUP(A70,Master!$B$12:$T$78,15, FALSE))","v":""},{"$f":"IF(A70 = \"\", \"\",VLOOKUP(A70,Master!$B$12:$T$78,16, FALSE))","v":""}]
[null,{"$f":"IF(A71 = \"\", \"\",VLOOKUP(A71,Master!$B$12:$T$78,2, FALSE))","v":""},null,{"$f":"IF(A71 = \"\", \"\",VLOOKUP(A71,Master!$B$12:$T$78,11, FALSE))","v":""},{"$f":"IF(A71 = \"\", \"\",VLOOKUP(A71,Master!$B$12:$T$78,12, FALSE))","v":""},{"$f":"IF(A71 = \"\", \"\",VLOOKUP(A71,Master!$B$12:$T$78,13, FALSE))","v":""},{"$f":"IF(A71 = \"\", \"\",VLOOKUP(A71,Master!$B$12:$T$78,14, FALSE))","v":""},{"$f":"IF(A71 = \"\", \"\",VLOOKUP(A71,Master!$B$12:$T$78,15, FALSE))","v":""},{"$f":"IF(A71 = \"\", \"\",VLOOKUP(A71,Master!$B$12:$T$78,16, FALSE))","v":""}]
[null,{"$f":"IF(A72 = \"\", \"\",VLOOKUP(A72,Master!$B$12:$T$78,2, FALSE))","v":""},null,{"$f":"IF(A72 = \"\", \"\",VLOOKUP(A72,Master!$B$12:$T$78,11, FALSE))","v":""},{"$f":"IF(A72 = \"\", \"\",VLOOKUP(A72,Master!$B$12:$T$78,12, FALSE))","v":""},{"$f":"IF(A72 = \"\", \"\",VLOOKUP(A72,Master!$B$12:$T$78,13, FALSE))","v":""},{"$f":"IF(A72 = \"\", \"\",VLOOKUP(A72,Master!$B$12:$T$78,14, FALSE))","v":""},{"$f":"IF(A72 = \"\", \"\",VLOOKUP(A72,Master!$B$12:$T$78,15, FALSE))","v":""},{"$f":"IF(A72 = \"\", \"\",VLOOKUP(A72,Master!$B$12:$T$78,16, FALSE))","v":""}]
[null,{"$f":"IF(A73 = \"\", \"\",VLOOKUP(A73,Master!$B$12:$T$78,2, FALSE))","v":""},null,{"$f":"IF(A73 = \"\", \"\",VLOOKUP(A73,Master!$B$12:$T$78,11, FALSE))","v":""},{"$f":"IF(A73 = \"\", \"\",VLOOKUP(A73,Master!$B$12:$T$78,12, FALSE))","v":""},{"$f":"IF(A73 = \"\", \"\",VLOOKUP(A73,Master!$B$12:$T$78,13, FALSE))","v":""},{"$f":"IF(A73 = \"\", \"\",VLOOKUP(A73,Master!$B$12:$T$78,14, FALSE))","v":""},{"$f":"IF(A73 = \"\", \"\",VLOOKUP(A73,Master!$B$12:$T$78,15, FALSE))","v":""},{"$f":"IF(A73 = \"\", \"\",VLOOKUP(A73,Master!$B$12:$T$78,16, FALSE))","v":""}]
[null,{"$f":"IF(A74 = \"\", \"\",VLOOKUP(A74,Master!$B$12:$T$78,2, FALSE))","v":""},null,{"$f":"IF(A74 = \"\", \"\",VLOOKUP(A74,Master!$B$12:$T$78,11, FALSE))","v":""},{"$f":"IF(A74 = \"\", \"\",VLOOKUP(A74,Master!$B$12:$T$78,12, FALSE))","v":""},{"$f":"IF(A74 = \"\", \"\",VLOOKUP(A74,Master!$B$12:$T$78,13, FALSE))","v":""},{"$f":"IF(A74 = \"\", \"\",VLOOKUP(A74,Master!$B$12:$T$78,14, FALSE))","v":""},{"$f":"IF(A74 = \"\", \"\",VLOOKUP(A74,Master!$B$12:$T$78,15, FALSE))","v":""},{"$f":"IF(A74 = \"\", \"\",VLOOKUP(A74,Master!$B$12:$T$78,16, FALSE))","v":""}]
[null,{"$f":"IF(A75 = \"\", \"\",VLOOKUP(A75,Master!$B$12:$T$78,2, FALSE))","v":""},null,{"$f":"IF(A75 = \"\", \"\",VLOOKUP(A75,Master!$B$12:$T$78,11, FALSE))","v":""},{"$f":"IF(A75 = \"\", \"\",VLOOKUP(A75,Master!$B$12:$T$78,12, FALSE))","v":""},{"$f":"IF(A75 = \"\", \"\",VLOOKUP(A75,Master!$B$12:$T$78,13, FALSE))","v":""},{"$f":"IF(A75 = \"\", \"\",VLOOKUP(A75,Master!$B$12:$T$78,14, FALSE))","v":""},{"$f":"IF(A75 = \"\", \"\",VLOOKUP(A75,Master!$B$12:$T$78,15, FALSE))","v":""},{"$f":"IF(A75 = \"\", \"\",VLOOKUP(A75,Master!$B$12:$T$78,16, FALSE))","v":""}]
[null,{"$f":"IF(A76 = \"\", \"\",VLOOKUP(A76,Master!$B$12:$T$78,2, FALSE))","v":""},null,{"$f":"IF(A76 = \"\", \"\",VLOOKUP(A76,Master!$B$12:$T$78,11, FALSE))","v":""},{"$f":"IF(A76 = \"\", \"\",VLOOKUP(A76,Master!$B$12:$T$78,12, FALSE))","v":""},{"$f":"IF(A76 = \"\", \"\",VLOOKUP(A76,Master!$B$12:$T$78,13, FALSE))","v":""},{"$f":"IF(A76 = \"\", \"\",VLOOKUP(A76,Master!$B$12:$T$78,14, FALSE))","v":""},{"$f":"IF(A76 = \"\", \"\",VLOOKUP(A76,Master!$B$12:$T$78,15, FALSE))","v":""},{"$f":"IF(A76 = \"\", \"\",VLOOKUP(A76,Master!$B$12:$T$78,16, FALSE))","v":""}]
[null,{"$f":"IF(A77 = \"\", \"\",VLOOKUP(A77,Master!$B$12:$T$78,2, FALSE))","v":""},null,{"$f":"IF(A77 = \"\", \"\",VLOOKUP(A77,Master!$B$12:$T$78,11, FALSE))","v":""},{"$f":"IF(A77 = \"\", \"\",VLOOKUP(A77,Master!$B$12:$T$78,12, FALSE))","v":""},{"$f":"IF(A77 = \"\", \"\",VLOOKUP(A77,Master!$B$12:$T$78,13, FALSE))","v":""},{"$f":"IF(A77 = \"\", \"\",VLOOKUP(A77,Master!$B$12:$T$78,14, FALSE))","v":""},{"$f":"IF(A77 = \"\", \"\",VLOOKUP(A77,Master!$B$12:$T$78,15, FALSE))","v":""},{"$f":"IF(A77 = \"\", \"\",VLOOKUP(A77,Master!$B$12:$T$78,16, FALSE))","v":""}]
[null,{"$f":"IF(A78 = \"\", \"\",VLOOKUP(A78,Master!$B$12:$T$78,2, FALSE))","v":""},null,{"$f":"IF(A78 = \"\", \"\",VLOOKUP(A78,Master!$B$12:$T$78,11, FALSE))","v":""},{"$f":"IF(A78 = \"\", \"\",VLOOKUP(A78,Master!$B$12:$T$78,12, FALSE))","v":""},{"$f":"IF(A78 = \"\", \"\",VLOOKUP(A78,Master!$B$12:$T$78,13, FALSE))","v":""},{"$f":"IF(A78 = \"\", \"\",VLOOKUP(A78,Master!$B$12:$T$78,14, FALSE))","v":""},{"$f":"IF(A78 = \"\", \"\",VLOOKUP(A78,Master!$B$12:$T$78,15, FALSE))","v":""},{"$f":"IF(A78 = \"\", \"\",VLOOKUP(A78,Master!$B$12:$T$78,16, FALSE))","v":""}]
[null,{"$f":"IF(A79 = \"\", \"\",VLOOKUP(A79,Master!$B$12:$T$78,2, FALSE))","v":""},null,{"$f":"IF(A79 = \"\", \"\",VLOOKUP(A79,Master!$B$12:$T$78,11, FALSE))","v":""},{"$f":"IF(A79 = \"\", \"\",VLOOKUP(A79,Master!$B$12:$T$78,12, FALSE))","v":""},{"$f":"IF(A79 = \"\", \"\",VLOOKUP(A79,Master!$B$12:$T$78,13, FALSE))","v":""},{"$f":"IF(A79 = \"\", \"\",VLOOKUP(A79,Master!$B$12:$T$78,14, FALSE))","v":""},{"$f":"IF(A79 = \"\", \"\",VLOOKUP(A79,Master!$B$12:$T$78,15, FALSE))","v":""},{"$f":"IF(A79 = \"\", \"\",VLOOKUP(A79,Master!$B$12:$T$78,16, FALSE))","v":""}]
[null,{"$f":"IF(A80 = \"\", \"\",VLOOKUP(A80,Master!$B$12:$T$78,2, FALSE))","v":""},null,{"$f":"IF(A80 = \"\", \"\",VLOOKUP(A80,Master!$B$12:$T$78,11, FALSE))","v":""},{"$f":"IF(A80 = \"\", \"\",VLOOKUP(A80,Master!$B$12:$T$78,12, FALSE))","v":""},{"$f":"IF(A80 = \"\", \"\",VLOOKUP(A80,Master!$B$12:$T$78,13, FALSE))","v":""},{"$f":"IF(A80 = \"\", \"\",VLOOKUP(A80,Master!$B$12:$T$78,14, FALSE))","v":""},{"$f":"IF(A80 = \"\", \"\",VLOOKUP(A80,Master!$B$12:$T$78,15, FALSE))","v":""},{"$f":"IF(A80 = \"\", \"\",VLOOKUP(A80,Master!$B$12:$T$78,16, FALSE))","v":""}]
[null,{"$f":"IF(A81 = \"\", \"\",VLOOKUP(A81,Master!$B$12:$T$78,2, FALSE))","v":""},null,{"$f":"IF(A81 = \"\", \"\",VLOOKUP(A81,Master!$B$12:$T$78,11, FALSE))","v":""},{"$f":"IF(A81 = \"\", \"\",VLOOKUP(A81,Master!$B$12:$T$78,12, FALSE))","v":""},{"$f":"IF(A81 = \"\", \"\",VLOOKUP(A81,Master!$B$12:$T$78,13, FALSE))","v":""},{"$f":"IF(A81 = \"\", \"\",VLOOKUP(A81,Master!$B$12:$T$78,14, FALSE))","v":""},{"$f":"IF(A81 = \"\", \"\",VLOOKUP(A81,Master!$B$12:$T$78,15, FALSE))","v":""},{"$f":"IF(A81 = \"\", \"\",VLOOKUP(A81,Master!$B$12:$T$78,16, FALSE))","v":""}]
[null,{"$f":"IF(A82 = \"\", \"\",VLOOKUP(A82,Master!$B$12:$T$78,2, FALSE))","v":""},null,{"$f":"IF(A82 = \"\", \"\",VLOOKUP(A82,Master!$B$12:$T$78,11, FALSE))","v":""},{"$f":"IF(A82 = \"\", \"\",VLOOKUP(A82,Master!$B$12:$T$78,12, FALSE))","v":""},{"$f":"IF(A82 = \"\", \"\",VLOOKUP(A82,Master!$B$12:$T$78,13, FALSE))","v":""},{"$f":"IF(A82 = \"\", \"\",VLOOKUP(A82,Master!$B$12:$T$78,14, FALSE))","v":""},{"$f":"IF(A82 = \"\", \"\",VLOOKUP(A82,Master!$B$12:$T$78,15, FALSE))","v":""},{"$f":"IF(A82 = \"\", \"\",VLOOKUP(A82,Master!$B$12:$T$78,16, FALSE))","v":""}]
[null,{"$f":"IF(A83 = \"\", \"\",VLOOKUP(A83,Master!$B$12:$T$78,2, FALSE))","v":""},null,{"$f":"IF(A83 = \"\", \"\",VLOOKUP(A83,Master!$B$12:$T$78,11, FALSE))","v":""},{"$f":"IF(A83 = \"\", \"\",VLOOKUP(A83,Master!$B$12:$T$78,12, FALSE))","v":""},{"$f":"IF(A83 = \"\", \"\",VLOOKUP(A83,Master!$B$12:$T$78,13, FALSE))","v":""},{"$f":"IF(A83 = \"\", \"\",VLOOKUP(A83,Master!$B$12:$T$78,14, FALSE))","v":""},{"$f":"IF(A83 = \"\", \"\",VLOOKUP(A83,Master!$B$12:$T$78,15, FALSE))","v":""},{"$f":"IF(A83 = \"\", \"\",VLOOKUP(A83,Master!$B$12:$T$78,16, FALSE))","v":""}]
[null,{"$f":"IF(A84 = \"\", \"\",VLOOKUP(A84,Master!$B$12:$T$78,2, FALSE))","v":""},null,{"$f":"IF(A84 = \"\", \"\",VLOOKUP(A84,Master!$B$12:$T$78,11, FALSE))","v":""},{"$f":"IF(A84 = \"\", \"\",VLOOKUP(A84,Master!$B$12:$T$78,12, FALSE))","v":""},{"$f":"IF(A84 = \"\", \"\",VLOOKUP(A84,Master!$B$12:$T$78,13, FALSE))","v":""},{"$f":"IF(A84 = \"\", \"\",VLOOKUP(A84,Master!$B$12:$T$78,14, FALSE))","v":""},{"$f":"IF(A84 = \"\", \"\",VLOOKUP(A84,Master!$B$12:$T$78,15, FALSE))","v":""},{"$f":"IF(A84 = \"\", \"\",VLOOKUP(A84,Master!$B$12:$T$78,16, FALSE))","v":""}]
[null,{"$f":"IF(A85 = \"\", \"\",VLOOKUP(A85,Master!$B$12:$T$78,2, FALSE))","v":""},null,{"$f":"IF(A85 = \"\", \"\",VLOOKUP(A85,Master!$B$12:$T$78,11, FALSE))","v":""},{"$f":"IF(A85 = \"\", \"\",VLOOKUP(A85,Master!$B$12:$T$78,12, FALSE))","v":""},{"$f":"IF(A85 = \"\", \"\",VLOOKUP(A85,Master!$B$12:$T$78,13, FALSE))","v":""},{"$f":"IF(A85 = \"\", \"\",VLOOKUP(A85,Master!$B$12:$T$78,14, FALSE))","v":""},{"$f":"IF(A85 = \"\", \"\",VLOOKUP(A85,Master!$B$12:$T$78,15, FALSE))","v":""},{"$f":"IF(A85 = \"\", \"\",VLOOKUP(A85,Master!$B$12:$T$78,16, FALSE))","v":""}]
[null,{"$f":"IF(A86 = \"\", \"\",VLOOKUP(A86,Master!$B$12:$T$78,2, FALSE))","v":""},null,{"$f":"IF(A86 = \"\", \"\",VLOOKUP(A86,Master!$B$12:$T$78,11, FALSE))","v":""},{"$f":"IF(A86 = \"\", \"\",VLOOKUP(A86,Master!$B$12:$T$78,12, FALSE))","v":""},{"$f":"IF(A86 = \"\", \"\",VLOOKUP(A86,Master!$B$12:$T$78,13, FALSE))","v":""},{"$f":"IF(A86 = \"\", \"\",VLOOKUP(A86,Master!$B$12:$T$78,14, FALSE))","v":""},{"$f":"IF(A86 = \"\", \"\",VLOOKUP(A86,Master!$B$12:$T$78,15, FALSE))","v":""},{"$f":"IF(A86 = \"\", \"\",VLOOKUP(A86,Master!$B$12:$T$78,16, FALSE))","v":""}]
[null,{"$f":"IF(A87 = \"\", \"\",VLOOKUP(A87,Master!$B$12:$T$78,2, FALSE))","v":""},null,{"$f":"IF(A87 = \"\", \"\",VLOOKUP(A87,Master!$B$12:$T$78,11, FALSE))","v":""},{"$f":"IF(A87 = \"\", \"\",VLOOKUP(A87,Master!$B$12:$T$78,12, FALSE))","v":""},{"$f":"IF(A87 = \"\", \"\",VLOOKUP(A87,Master!$B$12:$T$78,13, FALSE))","v":""},{"$f":"IF(A87 = \"\", \"\",VLOOKUP(A87,Master!$B$12:$T$78,14, FALSE))","v":""},{"$f":"IF(A87 = \"\", \"\",VLOOKUP(A87,Master!$B$12:$T$78,15, FALSE))","v":""},{"$f":"IF(A87 = \"\", \"\",VLOOKUP(A87,Master!$B$12:$T$78,16, FALSE))","v":""}]
[null,{"$f":"IF(A88 = \"\", \"\",VLOOKUP(A88,Master!$B$12:$T$78,2, FALSE))","v":""},null,{"$f":"IF(A88 = \"\", \"\",VLOOKUP(A88,Master!$B$12:$T$78,11, FALSE))","v":""},{"$f":"IF(A88 = \"\", \"\",VLOOKUP(A88,Master!$B$12:$T$78,12, FALSE))","v":""},{"$f":"IF(A88 = \"\", \"\",VLOOKUP(A88,Master!$B$12:$T$78,13, FALSE))","v":""},{"$f":"IF(A88 = \"\", \"\",VLOOKUP(A88,Master!$B$12:$T$78,14, FALSE))","v":""},{"$f":"IF(A88 = \"\", \"\",VLOOKUP(A88,Master!$B$12:$T$78,15, FALSE))","v":""},{"$f":"IF(A88 = \"\", \"\",VLOOKUP(A88,Master!$B$12:$T$78,16, FALSE))","v":""}]
[null,{"$f":"IF(A89 = \"\", \"\",VLOOKUP(A89,Master!$B$12:$T$78,2, FALSE))","v":""},null,{"$f":"IF(A89 = \"\", \"\",VLOOKUP(A89,Master!$B$12:$T$78,11, FALSE))","v":""},{"$f":"IF(A89 = \"\", \"\",VLOOKUP(A89,Master!$B$12:$T$78,12, FALSE))","v":""},{"$f":"IF(A89 = \"\", \"\",VLOOKUP(A89,Master!$B$12:$T$78,13, FALSE))","v":""},{"$f":"IF(A89 = \"\", \"\",VLOOKUP(A89,Master!$B$12:$T$78,14, FALSE))","v":""},{"$f":"IF(A89 = \"\", \"\",VLOOKUP(A89,Master!$B$12:$T$78,15, FALSE))","v":""},{"$f":"IF(A89 = \"\", \"\",VLOOKUP(A89,Master!$B$12:$T$78,16, FALSE))","v":""}]
[null,{"$f":"IF(A90 = \"\", \"\",VLOOKUP(A90,Master!$B$12:$T$78,2, FALSE))","v":""},null,{"$f":"IF(A90 = \"\", \"\",VLOOKUP(A90,Master!$B$12:$T$78,11, FALSE))","v":""},{"$f":"IF(A90 = \"\", \"\",VLOOKUP(A90,Master!$B$12:$T$78,12, FALSE))","v":""},{"$f":"IF(A90 = \"\", \"\",VLOOKUP(A90,Master!$B$12:$T$78,13, FALSE))","v":""},{"$f":"IF(A90 = \"\", \"\",VLOOKUP(A90,Master!$B$12:$T$78,14, FALSE))","v":""},{"$f":"IF(A90 = \"\", \"\",VLOOKUP(A90,Master!$B$12:$T$78,15, FALSE))","v":""},{"$f":"IF(A90 = \"\", \"\",VLOOKUP(A90,Master!$B$12:$T$78,16, FALSE))","v":""}]
[null,{"$f":"IF(A91 = \"\", \"\",VLOOKUP(A91,Master!$B$12:$T$78,2, FALSE))","v":""},null,{"$f":"IF(A91 = \"\", \"\",VLOOKUP(A91,Master!$B$12:$T$78,11, FALSE))","v":""},{"$f":"IF(A91 = \"\", \"\",VLOOKUP(A91,Master!$B$12:$T$78,12, FALSE))","v":""},{"$f":"IF(A91 = \"\", \"\",VLOOKUP(A91,Master!$B$12:$T$78,13, FALSE))","v":""},{"$f":"IF(A91 = \"\", \"\",VLOOKUP(A91,Master!$B$12:$T$78,14, FALSE))","v":""},{"$f":"IF(A91 = \"\", \"\",VLOOKUP(A91,Master!$B$12:$T$78,15, FALSE))","v":""},{"$f":"IF(A91 = \"\", \"\",VLOOKUP(A91,Master!$B$12:$T$78,16, FALSE))","v":""}]
[null,{"$f":"IF(A92 = \"\", \"\",VLOOKUP(A92,Master!$B$12:$T$78,2, FALSE))","v":""},null,{"$f":"IF(A92 = \"\", \"\",VLOOKUP(A92,Master!$B$12:$T$78,11, FALSE))","v":""},{"$f":"IF(A92 = \"\", \"\",VLOOKUP(A92,Master!$B$12:$T$78,12, FALSE))","v":""},{"$f":"IF(A92 = \"\", \"\",VLOOKUP(A92,Master!$B$12:$T$78,13, FALSE))","v":""},{"$f":"IF(A92 = \"\", \"\",VLOOKUP(A92,Master!$B$12:$T$78,14, FALSE))","v":""},{"$f":"IF(A92 = \"\", \"\",VLOOKUP(A92,Master!$B$12:$T$78,15, FALSE))","v":""},{"$f":"IF(A92 = \"\", \"\",VLOOKUP(A92,Master!$B$12:$T$78,16, FALSE))","v":""}]
[null,{"$f":"IF(A93 = \"\", \"\",VLOOKUP(A93,Master!$B$12:$T$78,2, FALSE))","v":""},null,{"$f":"IF(A93 = \"\", \"\",VLOOKUP(A93,Master!$B$12:$T$78,11, FALSE))","v":""},{"$f":"IF(A93 = \"\", \"\",VLOOKUP(A93,Master!$B$12:$T$78,12, FALSE))","v":""},{"$f":"IF(A93 = \"\", \"\",VLOOKUP(A93,Master!$B$12:$T$78,13, FALSE))","v":""},{"$f":"IF(A93 = \"\", \"\",VLOOKUP(A93,Master!$B$12:$T$78,14, FALSE))","v":""},{"$f":"IF(A93 = \"\", \"\",VLOOKUP(A93,Master!$B$12:$T$78,15, FALSE))","v":""},{"$f":"IF(A93 = \"\", \"\",VLOOKUP(A93,Master!$B$12:$T$78,16, FALSE))","v":""}]
[null,{"$f":"IF(A94 = \"\", \"\",VLOOKUP(A94,Master!$B$12:$T$78,2, FALSE))","v":""},null,{"$f":"IF(A94 = \"\", \"\",VLOOKUP(A94,Master!$B$12:$T$78,11, FALSE))","v":""},{"$f":"IF(A94 = \"\", \"\",VLOOKUP(A94,Master!$B$12:$T$78,12, FALSE))","v":""},{"$f":"IF(A94 = \"\", \"\",VLOOKUP(A94,Master!$B$12:$T$78,13, FALSE))","v":""},{"$f":"IF(A94 = \"\", \"\",VLOOKUP(A94,Master!$B$12:$T$78,14, FALSE))","v":""},{"$f":"IF(A94 = \"\", \"\",VLOOKUP(A94,Master!$B$12:$T$78,15, FALSE))","v":""},{"$f":"IF(A94 = \"\", \"\",VLOOKUP(A94,Master!$B$12:$T$78,16, FALSE))","v":""}]
[null,{"$f":"IF(A95 = \"\", \"\",VLOOKUP(A95,Master!$B$12:$T$78,2, FALSE))","v":""},null,{"$f":"IF(A95 = \"\", \"\",VLOOKUP(A95,Master!$B$12:$T$78,11, FALSE))","v":""},{"$f":"IF(A95 = \"\", \"\",VLOOKUP(A95,Master!$B$12:$T$78,12, FALSE))","v":""},{"$f":"IF(A95 = \"\", \"\",VLOOKUP(A95,Master!$B$12:$T$78,13, FALSE))","v":""},{"$f":"IF(A95 = \"\", \"\",VLOOKUP(A95,Master!$B$12:$T$78,14, FALSE))","v":""},{"$f":"IF(A95 = \"\", \"\",VLOOKUP(A95,Master!$B$12:$T$78,15, FALSE))","v":""},{"$f":"IF(A95 = \"\", \"\",VLOOKUP(A95,Master!$B$12:$T$78,16, FALSE))","v":""}]
[null,{"$f":"IF(A96 = \"\", \"\",VLOOKUP(A96,Master!$B$12:$T$78,2, FALSE))","v":""},null,{"$f":"IF(A96 = \"\", \"\",VLOOKUP(A96,Master!$B$12:$T$78,11, FALSE))","v":""},{"$f":"IF(A96 = \"\", \"\",VLOOKUP(A96,Master!$B$12:$T$78,12, FALSE))","v":""},{"$f":"IF(A96 = \"\", \"\",VLOOKUP(A96,Master!$B$12:$T$78,13, FALSE))","v":""},{"$f":"IF(A96 = \"\", \"\",VLOOKUP(A96,Master!$B$12:$T$78,14, FALSE))","v":""},{"$f":"IF(A96 = \"\", \"\",VLOOKUP(A96,Master!$B$12:$T$78,15, FALSE))","v":""},{"$f":"IF(A96 = \"\", \"\",VLOOKUP(A96,Master!$B$12:$T$78,16, FALSE))","v":""}]
[null,{"$f":"IF(A97 = \"\", \"\",VLOOKUP(A97,Master!$B$12:$T$78,2, FALSE))","v":""},null,{"$f":"IF(A97 = \"\", \"\",VLOOKUP(A97,Master!$B$12:$T$78,11, FALSE))","v":""},{"$f":"IF(A97 = \"\", \"\",VLOOKUP(A97,Master!$B$12:$T$78,12, FALSE))","v":""},{"$f":"IF(A97 = \"\", \"\",VLOOKUP(A97,Master!$B$12:$T$78,13, FALSE))","v":""},{"$f":"IF(A97 = \"\", \"\",VLOOKUP(A97,Master!$B$12:$T$78,14, FALSE))","v":""},{"$f":"IF(A97 = \"\", \"\",VLOOKUP(A97,Master!$B$12:$T$78,15, FALSE))","v":""},{"$f":"IF(A97 = \"\", \"\",VLOOKUP(A97,Master!$B$12:$T$78,16, FALSE))","v":""}]
[null,{"$f":"IF(A98 = \"\", \"\",VLOOKUP(A98,Master!$B$12:$T$78,2, FALSE))","v":""},null,{"$f":"IF(A98 = \"\", \"\",VLOOKUP(A98,Master!$B$12:$T$78,11, FALSE))","v":""},{"$f":"IF(A98 = \"\", \"\",VLOOKUP(A98,Master!$B$12:$T$78,12, FALSE))","v":""},{"$f":"IF(A98 = \"\", \"\",VLOOKUP(A98,Master!$B$12:$T$78,13, FALSE))","v":""},{"$f":"IF(A98 = \"\", \"\",VLOOKUP(A98,Master!$B$12:$T$78,14, FALSE))","v":""},{"$f":"IF(A98 = \"\", \"\",VLOOKUP(A98,Master!$B$12:$T$78,15, FALSE))","v":""},{"$f":"IF(A98 = \"\", \"\",VLOOKUP(A98,Master!$B$12:$T$78,16, FALSE))","v":""}]
[null,{"$f":"IF(A99 = \"\", \"\",VLOOKUP(A99,Master!$B$12:$T$78,2, FALSE))","v":""},null,{"$f":"IF(A99 = \"\", \"\",VLOOKUP(A99,Master!$B$12:$T$78,11, FALSE))","v":""},{"$f":"IF(A99 = \"\", \"\",VLOOKUP(A99,Master!$B$12:$T$78,12, FALSE))","v":""},{"$f":"IF(A99 = \"\", \"\",VLOOKUP(A99,Master!$B$12:$T$78,13, FALSE))","v":""},{"$f":"IF(A99 = \"\", \"\",VLOOKUP(A99,Master!$B$12:$T$78,14, FALSE))","v":""},{"$f":"IF(A99 = \"\", \"\",VLOOKUP(A99,Master!$B$12:$T$78,15, FALSE))","v":""},{"$f":"IF(A99 = \"\", \"\",VLOOKUP(A99,Master!$B$12:$T$78,16, FALSE))","v":""}]
[null,{"$f":"IF(A100 = \"\", \"\",VLOOKUP(A100,Master!$B$12:$T$78,2, FALSE))","v":""},null,{"$f":"IF(A100 = \"\", \"\",VLOOKUP(A100,Master!$B$12:$T$78,11, FALSE))","v":""},{"$f":"IF(A100 = \"\", \"\",VLOOKUP(A100,Master!$B$12:$T$78,12, FALSE))","v":""},{"$f":"IF(A100 = \"\", \"\",VLOOKUP(A100,Master!$B$12:$T$78,13, FALSE))","v":""},{"$f":"IF(A100 = \"\", \"\",VLOOKUP(A100,Master!$B$12:$T$78,14, FALSE))","v":""},{"$f":"IF(A100 = \"\", \"\",VLOOKUP(A100,Master!$B$12:$T$78,15, FALSE))","v":""},{"$f":"IF(A100 = \"\", \"\",VLOOKUP(A100,Master!$B$12:$T$78,16, FALSE))","v":""}]
[null,{"$f":"IF(A101 = \"\", \"\",VLOOKUP(A101,Master!$B$12:$T$78,2, FALSE))","v":""},null,{"$f":"IF(A101 = \"\", \"\",VLOOKUP(A101,Master!$B$12:$T$78,11, FALSE))","v":""},{"$f":"IF(A101 = \"\", \"\",VLOOKUP(A101,Master!$B$12:$T$78,12, FALSE))","v":""},{"$f":"IF(A101 = \"\", \"\",VLOOKUP(A101,Master!$B$12:$T$78,13, FALSE))","v":""},{"$f":"IF(A101 = \"\", \"\",VLOOKUP(A101,Master!$B$12:$T$78,14, FALSE))","v":""},{"$f":"IF(A101 = \"\", \"\",VLOOKUP(A101,Master!$B$12:$T$78,15, FALSE))","v":""},{"$f":"IF(A101 = \"\", \"\",VLOOKUP(A101,Master!$B$12:$T$78,16, FALSE))","v":""}]
[null,{"$f":"IF(A102 = \"\", \"\",VLOOKUP(A102,Master!$B$12:$T$78,2, FALSE))","v":""},null,{"$f":"IF(A102 = \"\", \"\",VLOOKUP(A102,Master!$B$12:$T$78,11, FALSE))","v":""},{"$f":"IF(A102 = \"\", \"\",VLOOKUP(A102,Master!$B$12:$T$78,12, FALSE))","v":""},{"$f":"IF(A102 = \"\", \"\",VLOOKUP(A102,Master!$B$12:$T$78,13, FALSE))","v":""},{"$f":"IF(A102 = \"\", \"\",VLOOKUP(A102,Master!$B$12:$T$78,14, FALSE))","v":""},{"$f":"IF(A102 = \"\", \"\",VLOOKUP(A102,Master!$B$12:$T$78,15, FALSE))","v":""},{"$f":"IF(A102 = \"\", \"\",VLOOKUP(A102,Master!$B$12:$T$78,16, FALSE))","v":""}]
[null,{"$f":"IF(A103 = \"\", \"\",VLOOKUP(A103,Master!$B$12:$T$78,2, FALSE))","v":""},null,{"$f":"IF(A103 = \"\", \"\",VLOOKUP(A103,Master!$B$12:$T$78,11, FALSE))","v":""},{"$f":"IF(A103 = \"\", \"\",VLOOKUP(A103,Master!$B$12:$T$78,12, FALSE))","v":""},{"$f":"IF(A103 = \"\", \"\",VLOOKUP(A103,Master!$B$12:$T$78,13, FALSE))","v":""},{"$f":"IF(A103 = \"\", \"\",VLOOKUP(A103,Master!$B$12:$T$78,14, FALSE))","v":""},{"$f":"IF(A103 = \"\", \"\",VLOOKUP(A103,Master!$B$12:$T$78,15, FALSE))","v":""},{"$f":"IF(A103 = \"\", \"\",VLOOKUP(A103,Master!$B$12:$T$78,16, FALSE))","v":""}]
[null,{"$f":"IF(A104 = \"\", \"\",VLOOKUP(A104,Master!$B$12:$T$78,2, FALSE))","v":""},null,{"$f":"IF(A104 = \"\", \"\",VLOOKUP(A104,Master!$B$12:$T$78,11, FALSE))","v":""},{"$f":"IF(A104 = \"\", \"\",VLOOKUP(A104,Master!$B$12:$T$78,12, FALSE))","v":""},{"$f":"IF(A104 = \"\", \"\",VLOOKUP(A104,Master!$B$12:$T$78,13, FALSE))","v":""},{"$f":"IF(A104 = \"\", \"\",VLOOKUP(A104,Master!$B$12:$T$78,14, FALSE))","v":""},{"$f":"IF(A104 = \"\", \"\",VLOOKUP(A104,Master!$B$12:$T$78,15, FALSE))","v":""},{"$f":"IF(A104 = \"\", \"\",VLOOKUP(A104,Master!$B$12:$T$78,16, FALSE))","v":""}]
[null,{"$f":"IF(A105 = \"\", \"\",VLOOKUP(A105,Master!$B$12:$T$78,2, FALSE))","v":""},null,{"$f":"IF(A105 = \"\", \"\",VLOOKUP(A105,Master!$B$12:$T$78,11, FALSE))","v":""},{"$f":"IF(A105 = \"\", \"\",VLOOKUP(A105,Master!$B$12:$T$78,12, FALSE))","v":""},{"$f":"IF(A105 = \"\", \"\",VLOOKUP(A105,Master!$B$12:$T$78,13, FALSE))","v":""},{"$f":"IF(A105 = \"\", \"\",VLOOKUP(A105,Master!$B$12:$T$78,14, FALSE))","v":""},{"$f":"IF(A105 = \"\", \"\",VLOOKUP(A105,Master!$B$12:$T$78,15, FALSE))","v":""},{"$f":"IF(A105 = \"\", \"\",VLOOKUP(A105,Master!$B$12:$T$78,16, FALSE))","v":""}]
[null,{"$f":"IF(A106 = \"\", \"\",VLOOKUP(A106,Master!$B$12:$T$78,2, FALSE))","v":""},null,{"$f":"IF(A106 = \"\", \"\",VLOOKUP(A106,Master!$B$12:$T$78,11, FALSE))","v":""},{"$f":"IF(A106 = \"\", \"\",VLOOKUP(A106,Master!$B$12:$T$78,12, FALSE))","v":""},{"$f":"IF(A106 = \"\", \"\",VLOOKUP(A106,Master!$B$12:$T$78,13, FALSE))","v":""},{"$f":"IF(A106 = \"\", \"\",VLOOKUP(A106,Master!$B$12:$T$78,14, FALSE))","v":""},{"$f":"IF(A106 = \"\", \"\",VLOOKUP(A106,Master!$B$12:$T$78,15, FALSE))","v":""},{"$f":"IF(A106 = \"\", \"\",VLOOKUP(A106,Master!$B$12:$T$78,16, FALSE))","v":""}]
[null,{"$f":"IF(A107 = \"\", \"\",VLOOKUP(A107,Master!$B$12:$T$78,2, FALSE))","v":""},null,{"$f":"IF(A107 = \"\", \"\",VLOOKUP(A107,Master!$B$12:$T$78,11, FALSE))","v":""},{"$f":"IF(A107 = \"\", \"\",VLOOKUP(A107,Master!$B$12:$T$78,12, FALSE))","v":""},{"$f":"IF(A107 = \"\", \"\",VLOOKUP(A107,Master!$B$12:$T$78,13, FALSE))","v":""},{"$f":"IF(A107 = \"\", \"\",VLOOKUP(A107,Master!$B$12:$T$78,14, FALSE))","v":""},{"$f":"IF(A107 = \"\", \"\",VLOOKUP(A107,Master!$B$12:$T$78,15, FALSE))","v":""},{"$f":"IF(A107 = \"\", \"\",VLOOKUP(A107,Master!$B$12:$T$78,16, FALSE))","v":""}]
[null,{"$f":"IF(A108 = \"\", \"\",VLOOKUP(A108,Master!$B$12:$T$78,2, FALSE))","v":""},null,{"$f":"IF(A108 = \"\", \"\",VLOOKUP(A108,Master!$B$12:$T$78,11, FALSE))","v":""},{"$f":"IF(A108 = \"\", \"\",VLOOKUP(A108,Master!$B$12:$T$78,12, FALSE))","v":""},{"$f":"IF(A108 = \"\", \"\",VLOOKUP(A108,Master!$B$12:$T$78,13, FALSE))","v":""},{"$f":"IF(A108 = \"\", \"\",VLOOKUP(A108,Master!$B$12:$T$78,14, FALSE))","v":""},{"$f":"IF(A108 = \"\", \"\",VLOOKUP(A108,Master!$B$12:$T$78,15, FALSE))","v":""},{"$f":"IF(A108 = \"\", \"\",VLOOKUP(A108,Master!$B$12:$T$78,16, FALSE))","v":""}]
[null,{"$f":"IF(A109 = \"\", \"\",VLOOKUP(A109,Master!$B$12:$T$78,2, FALSE))","v":""},null,{"$f":"IF(A109 = \"\", \"\",VLOOKUP(A109,Master!$B$12:$T$78,11, FALSE))","v":""},{"$f":"IF(A109 = \"\", \"\",VLOOKUP(A109,Master!$B$12:$T$78,12, FALSE))","v":""},{"$f":"IF(A109 = \"\", \"\",VLOOKUP(A109,Master!$B$12:$T$78,13, FALSE))","v":""},{"$f":"IF(A109 = \"\", \"\",VLOOKUP(A109,Master!$B$12:$T$78,14, FALSE))","v":""},{"$f":"IF(A109 = \"\", \"\",VLOOKUP(A109,Master!$B$12:$T$78,15, FALSE))","v":""},{"$f":"IF(A109 = \"\", \"\",VLOOKUP(A109,Master!$B$12:$T$78,16, FALSE))","v":""}]
[null,{"$f":"IF(A110 = \"\", \"\",VLOOKUP(A110,Master!$B$12:$T$78,2, FALSE))","v":""},null,{"$f":"IF(A110 = \"\", \"\",VLOOKUP(A110,Master!$B$12:$T$78,11, FALSE))","v":""},{"$f":"IF(A110 = \"\", \"\",VLOOKUP(A110,Master!$B$12:$T$78,12, FALSE))","v":""},{"$f":"IF(A110 = \"\", \"\",VLOOKUP(A110,Master!$B$12:$T$78,13, FALSE))","v":""},{"$f":"IF(A110 = \"\", \"\",VLOOKUP(A110,Master!$B$12:$T$78,14, FALSE))","v":""},{"$f":"IF(A110 = \"\", \"\",VLOOKUP(A110,Master!$B$12:$T$78,15, FALSE))","v":""},{"$f":"IF(A110 = \"\", \"\",VLOOKUP(A110,Master!$B$12:$T$78,16, FALSE))","v":""}]
[null,{"$f":"IF(A111 = \"\", \"\",VLOOKUP(A111,Master!$B$12:$T$78,2, FALSE))","v":""},null,{"$f":"IF(A111 = \"\", \"\",VLOOKUP(A111,Master!$B$12:$T$78,11, FALSE))","v":""},{"$f":"IF(A111 = \"\", \"\",VLOOKUP(A111,Master!$B$12:$T$78,12, FALSE))","v":""},{"$f":"IF(A111 = \"\", \"\",VLOOKUP(A111,Master!$B$12:$T$78,13, FALSE))","v":""},{"$f":"IF(A111 = \"\", \"\",VLOOKUP(A111,Master!$B$12:$T$78,14, FALSE))","v":""},{"$f":"IF(A111 = \"\", \"\",VLOOKUP(A111,Master!$B$12:$T$78,15, FALSE))","v":""},{"$f":"IF(A111 = \"\", \"\",VLOOKUP(A111,Master!$B$12:$T$78,16, FALSE))","v":""}]
[null,{"$f":"IF(A112 = \"\", \"\",VLOOKUP(A112,Master!$B$12:$T$78,2, FALSE))","v":""},null,{"$f":"IF(A112 = \"\", \"\",VLOOKUP(A112,Master!$B$12:$T$78,11, FALSE))","v":""},{"$f":"IF(A112 = \"\", \"\",VLOOKUP(A112,Master!$B$12:$T$78,12, FALSE))","v":""},{"$f":"IF(A112 = \"\", \"\",VLOOKUP(A112,Master!$B$12:$T$78,13, FALSE))","v":""},{"$f":"IF(A112 = \"\", \"\",VLOOKUP(A112,Master!$B$12:$T$78,14, FALSE))","v":""},{"$f":"IF(A112 = \"\", \"\",VLOOKUP(A112,Master!$B$12:$T$78,15, FALSE))","v":""},{"$f":"IF(A112 = \"\", \"\",VLOOKUP(A112,Master!$B$12:$T$78,16, FALSE))","v":""}]
[null,{"$f":"IF(A113 = \"\", \"\",VLOOKUP(A113,Master!$B$12:$T$78,2, FALSE))","v":""},null,{"$f":"IF(A113 = \"\", \"\",VLOOKUP(A113,Master!$B$12:$T$78,11, FALSE))","v":""},{"$f":"IF(A113 = \"\", \"\",VLOOKUP(A113,Master!$B$12:$T$78,12, FALSE))","v":""},{"$f":"IF(A113 = \"\", \"\",VLOOKUP(A113,Master!$B$12:$T$78,13, FALSE))","v":""},{"$f":"IF(A113 = \"\", \"\",VLOOKUP(A113,Master!$B$12:$T$78,14, FALSE))","v":""},{"$f":"IF(A113 = \"\", \"\",VLOOKUP(A113,Master!$B$12:$T$78,15, FALSE))","v":""},{"$f":"IF(A113 = \"\", \"\",VLOOKUP(A113,Master!$B$12:$T$78,16, FALSE))","v":""}]
[null,{"$f":"IF(A114 = \"\", \"\",VLOOKUP(A114,Master!$B$12:$T$78,2, FALSE))","v":""},null,{"$f":"IF(A114 = \"\", \"\",VLOOKUP(A114,Master!$B$12:$T$78,11, FALSE))","v":""},{"$f":"IF(A114 = \"\", \"\",VLOOKUP(A114,Master!$B$12:$T$78,12, FALSE))","v":""},{"$f":"IF(A114 = \"\", \"\",VLOOKUP(A114,Master!$B$12:$T$78,13, FALSE))","v":""},{"$f":"IF(A114 = \"\", \"\",VLOOKUP(A114,Master!$B$12:$T$78,14, FALSE))","v":""},{"$f":"IF(A114 = \"\", \"\",VLOOKUP(A114,Master!$B$12:$T$78,15, FALSE))","v":""},{"$f":"IF(A114 = \"\", \"\",VLOOKUP(A114,Master!$B$12:$T$78,16, FALSE))","v":""}]
[null,{"$f":"IF(A115 = \"\", \"\",VLOOKUP(A115,Master!$B$12:$T$78,2, FALSE))","v":""},null,{"$f":"IF(A115 = \"\", \"\",VLOOKUP(A115,Master!$B$12:$T$78,11, FALSE))","v":""},{"$f":"IF(A115 = \"\", \"\",VLOOKUP(A115,Master!$B$12:$T$78,12, FALSE))","v":""},{"$f":"IF(A115 = \"\", \"\",VLOOKUP(A115,Master!$B$12:$T$78,13, FALSE))","v":""},{"$f":"IF(A115 = \"\", \"\",VLOOKUP(A115,Master!$B$12:$T$78,14, FALSE))","v":""},{"$f":"IF(A115 = \"\", \"\",VLOOKUP(A115,Master!$B$12:$T$78,15, FALSE))","v":""},{"$f":"IF(A115 = \"\", \"\",VLOOKUP(A115,Master!$B$12:$T$78,16, FALSE))","v":""}]
[null,{"$f":"IF(A116 = \"\", \"\",VLOOKUP(A116,Master!$B$12:$T$78,2, FALSE))","v":""},null,{"$f":"IF(A116 = \"\", \"\",VLOOKUP(A116,Master!$B$12:$T$78,11, FALSE))","v":""},{"$f":"IF(A116 = \"\", \"\",VLOOKUP(A116,Master!$B$12:$T$78,12, FALSE))","v":""},{"$f":"IF(A116 = \"\", \"\",VLOOKUP(A116,Master!$B$12:$T$78,13, FALSE))","v":""},{"$f":"IF(A116 = \"\", \"\",VLOOKUP(A116,Master!$B$12:$T$78,14, FALSE))","v":""},{"$f":"IF(A116 = \"\", \"\",VLOOKUP(A116,Master!$B$12:$T$78,15, FALSE))","v":""},{"$f":"IF(A116 = \"\", \"\",VLOOKUP(A116,Master!$B$12:$T$78,16, FALSE))","v":""}]
[null,{"$f":"IF(A117 = \"\", \"\",VLOOKUP(A117,Master!$B$12:$T$78,2, FALSE))","v":""},null,{"$f":"IF(A117 = \"\", \"\",VLOOKUP(A117,Master!$B$12:$T$78,11, FALSE))","v":""},{"$f":"IF(A117 = \"\", \"\",VLOOKUP(A117,Master!$B$12:$T$78,12, FALSE))","v":""},{"$f":"IF(A117 = \"\", \"\",VLOOKUP(A117,Master!$B$12:$T$78,13, FALSE))","v":""},{"$f":"IF(A117 = \"\", \"\",VLOOKUP(A117,Master!$B$12:$T$78,14, FALSE))","v":""},{"$f":"IF(A117 = \"\", \"\",VLOOKUP(A117,Master!$B$12:$T$78,15, FALSE))","v":""},{"$f":"IF(A117 = \"\", \"\",VLOOKUP(A117,Master!$B$12:$T$78,16, FALSE))","v":""}]
[null,{"$f":"IF(A118 = \"\", \"\",VLOOKUP(A118,Master!$B$12:$T$78,2, FALSE))","v":""},null,{"$f":"IF(A118 = \"\", \"\",VLOOKUP(A118,Master!$B$12:$T$78,11, FALSE))","v":""},{"$f":"IF(A118 = \"\", \"\",VLOOKUP(A118,Master!$B$12:$T$78,12, FALSE))","v":""},{"$f":"IF(A118 = \"\", \"\",VLOOKUP(A118,Master!$B$12:$T$78,13, FALSE))","v":""},{"$f":"IF(A118 = \"\", \"\",VLOOKUP(A118,Master!$B$12:$T$78,14, FALSE))","v":""},{"$f":"IF(A118 = \"\", \"\",VLOOKUP(A118,Master!$B$12:$T$78,15, FALSE))","v":""},{"$f":"IF(A118 = \"\", \"\",VLOOKUP(A118,Master!$B$12:$T$78,16, FALSE))","v":""}]
[null,{"$f":"IF(A119 = \"\", \"\",VLOOKUP(A119,Master!$B$12:$T$78,2, FALSE))","v":""},null,{"$f":"IF(A119 = \"\", \"\",VLOOKUP(A119,Master!$B$12:$T$78,11, FALSE))","v":""},{"$f":"IF(A119 = \"\", \"\",VLOOKUP(A119,Master!$B$12:$T$78,12, FALSE))","v":""},{"$f":"IF(A119 = \"\", \"\",VLOOKUP(A119,Master!$B$12:$T$78,13, FALSE))","v":""},{"$f":"IF(A119 = \"\", \"\",VLOOKUP(A119,Master!$B$12:$T$78,14, FALSE))","v":""},{"$f":"IF(A119 = \"\", \"\",VLOOKUP(A119,Master!$B$12:$T$78,15, FALSE))","v":""},{"$f":"IF(A119 = \"\", \"\",VLOOKUP(A119,Master!$B$12:$T$78,16, FALSE))","v":""}]
[null,{"$f":"IF(A120 = \"\", \"\",VLOOKUP(A120,Master!$B$12:$T$78,2, FALSE))","v":""},null,{"$f":"IF(A120 = \"\", \"\",VLOOKUP(A120,Master!$B$12:$T$78,11, FALSE))","v":""},{"$f":"IF(A120 = \"\", \"\",VLOOKUP(A120,Master!$B$12:$T$78,12, FALSE))","v":""},{"$f":"IF(A120 = \"\", \"\",VLOOKUP(A120,Master!$B$12:$T$78,13, FALSE))","v":""},{"$f":"IF(A120 = \"\", \"\",VLOOKUP(A120,Master!$B$12:$T$78,14, FALSE))","v":""},{"$f":"IF(A120 = \"\", \"\",VLOOKUP(A120,Master!$B$12:$T$78,15, FALSE))","v":""},{"$f":"IF(A120 = \"\", \"\",VLOOKUP(A120,Master!$B$12:$T$78,16, FALSE))","v":""}]
[null,{"$f":"IF(A121 = \"\", \"\",VLOOKUP(A121,Master!$B$12:$T$78,2, FALSE))","v":""},null,{"$f":"IF(A121 = \"\", \"\",VLOOKUP(A121,Master!$B$12:$T$78,11, FALSE))","v":""},{"$f":"IF(A121 = \"\", \"\",VLOOKUP(A121,Master!$B$12:$T$78,12, FALSE))","v":""},{"$f":"IF(A121 = \"\", \"\",VLOOKUP(A121,Master!$B$12:$T$78,13, FALSE))","v":""},{"$f":"IF(A121 = \"\", \"\",VLOOKUP(A121,Master!$B$12:$T$78,14, FALSE))","v":""},{"$f":"IF(A121 = \"\", \"\",VLOOKUP(A121,Master!$B$12:$T$78,15, FALSE))","v":""},{"$f":"IF(A121 = \"\", \"\",VLOOKUP(A121,Master!$B$12:$T$78,16, FALSE))","v":""}]
[null,{"$f":"IF(A122 = \"\", \"\",VLOOKUP(A122,Master!$B$12:$T$78,2, FALSE))","v":""},null,{"$f":"IF(A122 = \"\", \"\",VLOOKUP(A122,Master!$B$12:$T$78,11, FALSE))","v":""},{"$f":"IF(A122 = \"\", \"\",VLOOKUP(A122,Master!$B$12:$T$78,12, FALSE))","v":""},{"$f":"IF(A122 = \"\", \"\",VLOOKUP(A122,Master!$B$12:$T$78,13, FALSE))","v":""},{"$f":"IF(A122 = \"\", \"\",VLOOKUP(A122,Master!$B$12:$T$78,14, FALSE))","v":""},{"$f":"IF(A122 = \"\", \"\",VLOOKUP(A122,Master!$B$12:$T$78,15, FALSE))","v":""},{"$f":"IF(A122 = \"\", \"\",VLOOKUP(A122,Master!$B$12:$T$78,16, FALSE))","v":""}]
[null,{"$f":"IF(A123 = \"\", \"\",VLOOKUP(A123,Master!$B$12:$T$78,2, FALSE))","v":""},null,{"$f":"IF(A123 = \"\", \"\",VLOOKUP(A123,Master!$B$12:$T$78,11, FALSE))","v":""},{"$f":"IF(A123 = \"\", \"\",VLOOKUP(A123,Master!$B$12:$T$78,12, FALSE))","v":""},{"$f":"IF(A123 = \"\", \"\",VLOOKUP(A123,Master!$B$12:$T$78,13, FALSE))","v":""},{"$f":"IF(A123 = \"\", \"\",VLOOKUP(A123,Master!$B$12:$T$78,14, FALSE))","v":""},{"$f":"IF(A123 = \"\", \"\",VLOOKUP(A123,Master!$B$12:$T$78,15, FALSE))","v":""},{"$f":"IF(A123 = \"\", \"\",VLOOKUP(A123,Master!$B$12:$T$78,16, FALSE))","v":""}]

{"sheet":"Treatment","index":6,"n_rows":123,"n_cols":7,"rows_kept":123,"cut":false,"hidden":false,"merged":[]}
["(SEMI-) CENTRALIZED TREATMENT"]
[]
[]
[]
[]
[]
[]
[]
[]
[]
[]
[]
[]
[]
[]
[]
[]
[]
[]
["Phase","Treatment"]
["Technology",{"$f":"Master!X1","v":"Treatment"},"Inputs","Outputs for disposal or further treatment",{"$f":"Master!AA1","v":"Outputs for reuse"},"Availability","Proceed to"]
["Activated sludge",{"$f":"IF(A22 = \"\", \"\", VLOOKUP(A22,Master!$B$91:$AC$115,COLUMN(Master!$Q$1)-1,FALSE))","v":"Offsite"},{"$f":"IF(A22 = \"\", \"\", VLOOKUP(A22,Master!$B$91:$AC$115,COLUMN(Master!$Y$1)-1,FALSE))","v":"Effluent, Blackwater, Brownwater, Greywater"},{"$f":"IF(A22 = \"\", \"\", VLOOKUP(A22,Master!$B$91:$AC$115,COLUMN(Master!$Z$1)-1,FALSE))","v":"Effluent, Sludge"},{"$f":"IF(A22 = \"\", \"\", VLOOKUP(A22,Master!$B$91:$AC$115,COLUMN(Master!$AA$1)-1,FALSE))","v":"None"},{"$f":"IF(A22 = \"\", \"\", VLOOKUP(A22,Master!$B$91:$AC$115,COLUMN(Master!$AB$1)-1,FALSE))","v":"Open source"},{"$f":"IF(A22 = \"\", \"\", VLOOKUP(A22,Master!$B$91:$AC$115,COLUMN(Master!$AC$1)-1,FALSE))","v":"Use and/or disposal"}]
["Aerated Pond",{"$f":"IF(A23 = \"\", \"\", VLOOKUP(A23,Master!$B$91:$AC$115,COLUMN(Master!$Q$1)-1,FALSE))","v":"Offsite"},{"$f":"IF(A23 = \"\", \"\", VLOOKUP(A23,Master!$B$91:$AC$115,COLUMN(Master!$Y$1)-1,FALSE))","v":"Effluent, Blackwater, Brownwater, Greywater"},{"$f":"IF(A23 = \"\", \"\", VLOOKUP(A23,Master!$B$91:$AC$115,COLUMN(Master!$Z$1)-1,FALSE))","v":"Effluent, Sludge"},{"$f":"IF(A23 = \"\", \"\", VLOOKUP(A23,Master!$B$91:$AC$115,COLUMN(Master!$AA$1)-1,FALSE))","v":"None"},{"$f":"IF(A23 = \"\", \"\", VLOOKUP(A23,Master!$B$91:$AC$115,COLUMN(Master!$AB$1)-1,FALSE))","v":"Open source"},{"$f":"IF(A23 = \"\", \"\", VLOOKUP(A23,Master!$B$91:$AC$115,COLUMN(Master!$AC$1)-1,FALSE))","v":"Use and/or disposal"}]
["Anaerobic Baffled Reactor",{"$f":"IF(A24 = \"\", \"\", VLOOKUP(A24,Master!$B$91:$AC$115,COLUMN(Master!$Q$1)-1,FALSE))","v":"Offsite"},{"$f":"IF(A24 = \"\", \"\", VLOOKUP(A24,Master!$B$91:$AC$115,COLUMN(Master!$Y$1)-1,FALSE))","v":"Blackwater, Greywater"},{"$f":"IF(A24 = \"\", \"\", VLOOKUP(A24,Master!$B$91:$AC$115,COLUMN(Master!$Z$1)-1,FALSE))","v":"Effluent, Sludge"},{"$f":"IF(A24 = \"\", \"\", VLOOKUP(A24,Master!$B$91:$AC$115,COLUMN(Master!$AA$1)-1,FALSE))","v":"None"},{"$f":"IF(A24 = \"\", \"\", VLOOKUP(A24,Master!$B$91:$AC$115,COLUMN(Master!$AB$1)-1,FALSE))","v":"Open source"},{"$f":"IF(A24 = \"\", \"\", VLOOKUP(A24,Master!$B$91:$AC$115,COLUMN(Master!$AC$1)-1,FALSE))","v":"Use and/or disposal"}]
["Anaerobic Filter",{"$f":"IF(A25 = \"\", \"\", VLOOKUP(A25,Master!$B$91:$AC$115,COLUMN(Master!$Q$1)-1,FALSE))","v":"Offsite"},{"$f":"IF(A25 = \"\", \"\", VLOOKUP(A25,Master!$B$91:$AC$115,COLUMN(Master!$Y$1)-1,FALSE))","v":"Blackwater, Greywater"},{"$f":"IF(A25 = \"\", \"\", VLOOKUP(A25,Master!$B$91:$AC$115,COLUMN(Master!$Z$1)-1,FALSE))","v":"Effluent, Sludge"},{"$f":"IF(A25 = \"\", \"\", VLOOKUP(A25,Master!$B$91:$AC$115,COLUMN(Master!$AA$1)-1,FALSE))","v":"None"},{"$f":"IF(A25 = \"\", \"\", VLOOKUP(A25,Master!$B$91:$AC$115,COLUMN(Master!$AB$1)-1,FALSE))","v":"Open source"},{"$f":"IF(A25 = \"\", \"\", VLOOKUP(A25,Master!$B$91:$AC$115,COLUMN(Master!$AC$1)-1,FALSE))","v":"Use and/or disposal"}]
["Anaerobic Membrance Bioreactor (AnMBR)",{"$f":"IF(A26 = \"\", \"\", VLOOKUP(A26,Master!$B$91:$AC$115,COLUMN(Master!$Q$1)-1,FALSE))","v":"Offsite"},{"$f":"IF(A26 = \"\", \"\", VLOOKUP(A26,Master!$B$91:$AC$115,COLUMN(Master!$Y$1)-1,FALSE))","v":"Blackwater, Greywater, Food waste"},{"$f":"IF(A26 = \"\", \"\", VLOOKUP(A26,Master!$B$91:$AC$115,COLUMN(Master!$Z$1)-1,FALSE))","v":"Sludge"},{"$f":"IF(A26 = \"\", \"\", VLOOKUP(A26,Master!$B$91:$AC$115,COLUMN(Master!$AA$1)-1,FALSE))","v":"Biogas"},{"$f":"IF(A26 = \"\", \"\", VLOOKUP(A26,Master!$B$91:$AC$115,COLUMN(Master!$AB$1)-1,FALSE))","v":"In development"},{"$f":"IF(A26 = \"\", \"\", VLOOKUP(A26,Master!$B$91:$AC$115,COLUMN(Master!$AC$1)-1,FALSE))","v":"Use and/or disposal"}]
["Biogas Reactor",{"$f":"IF(A27 = \"\", \"\", VLOOKUP(A27,Master!$B$91:$AC$115,COLUMN(Master!$Q$1)-1,FALSE))","v":"Offsite"},{"$f":"IF(A27 = \"\", \"\", VLOOKUP(A27,Master!$B$91:$AC$115,COLUMN(Master!$Y$1)-1,FALSE))","v":"Sludge, Organics, Blackwater"},{"$f":"IF(A27 = \"\", \"\", VLOOKUP(A27,Master!$B$91:$AC$115,COLUMN(Master!$Z$1)-1,FALSE))","v":"Sludge"},{"$f":"IF(A27 = \"\", \"\", VLOOKUP(A27,Master!$B$91:$AC$115,COLUMN(Master!$AA$1)-1,FALSE))","v":"Biogas"},{"$f":"IF(A27 = \"\", \"\", VLOOKUP(A27,Master!$B$91:$AC$115,COLUMN(Master!$AB$1)-1,FALSE))","v":"For purchase"},{"$f":"IF(A27 = \"\", \"\", VLOOKUP(A27,Master!$B$91:$AC$115,COLUMN(Master!$AC$1)-1,FALSE))","v":"Use and/or disposal"}]
["Bolah Bondeh Project: Organic Compost",{"$f":"IF(A28 = \"\", \"\", VLOOKUP(A28,Master!$B$91:$AC$115,COLUMN(Master!$Q$1)-1,FALSE))","v":"Offsite"},{"$f":"IF(A28 = \"\", \"\", VLOOKUP(A28,Master!$B$91:$AC$115,COLUMN(Master!$Y$1)-1,FALSE))","v":"Sludge"},{"$f":"IF(A28 = \"\", \"\", VLOOKUP(A28,Master!$B$91:$AC$115,COLUMN(Master!$Z$1)-1,FALSE))","v":"None"},{"$f":"IF(A28 = \"\", \"\", VLOOKUP(A28,Master!$B$91:$AC$115,COLUMN(Master!$AA$1)-1,FALSE))","v":"Compost"},{"$f":"IF(A28 = \"\", \"\", VLOOKUP(A28,Master!$B$91:$AC$115,COLUMN(Master!$AB$1)-1,FALSE))","v":"In development"},{"$f":"IF(A28 = \"\", \"\", VLOOKUP(A28,Master!$B$91:$AC$115,COLUMN(Master!$AC$1)-1,FALSE))","v":"Use and/or disposal"}]
["Co-composting",{"$f":"IF(A29 = \"\", \"\", VLOOKUP(A29,Master!$B$91:$AC$115,COLUMN(Master!$Q$1)-1,FALSE))","v":"Offsite"},{"$f":"IF(A29 = \"\", \"\", VLOOKUP(A29,Master!$B$91:$AC$115,COLUMN(Master!$Y$1)-1,FALSE))","v":"Sludge, Organics"},{"$f":"IF(A29 = \"\", \"\", VLOOKUP(A29,Master!$B$91:$AC$115,COLUMN(Master!$Z$1)-1,FALSE))","v":"None"},{"$f":"IF(A29 = \"\", \"\", VLOOKUP(A29,Master!$B$91:$AC$115,COLUMN(Master!$AA$1)-1,FALSE))","v":"Compost"},{"$f":"IF(A29 = \"\", \"\", VLOOKUP(A29,Master!$B$91:$AC$115,COLUMN(Master!$AB$1)-1,FALSE))","v":"Open source"},{"$f":"IF(A29 = \"\", \"\", VLOOKUP(A29,Master!$B$91:$AC$115,COLUMN(Master!$AC$1)-1,FALSE))","v":"Use and/or disposal"}]
["Community Vermiculture ",{"$f":"IF(A30 = \"\", \"\", VLOOKUP(A30,Master!$B$91:$AC$115,COLUMN(Master!$Q$1)-1,FALSE))","v":"Offsite"},{"$f":"IF(A30 = \"\", \"\", VLOOKUP(A30,Master!$B$91:$AC$115,COLUMN(Master!$Y$1)-1,FALSE))","v":"Sludge"},{"$f":"IF(A30 = \"\", \"\", VLOOKUP(A30,Master!$B$91:$AC$115,COLUMN(Master!$Z$1)-1,FALSE))","v":"None"},{"$f":"IF(A30 = \"\", \"\", VLOOKUP(A30,Master!$B$91:$AC$115,COLUMN(Master!$AA$1)-1,FALSE))","v":"Compost"},{"$f":"IF(A30 = \"\", \"\", VLOOKUP(A30,Master!$B$91:$AC$115,COLUMN(Master!$AB$1)-1,FALSE))","v":"In development"},{"$f":"IF(A30 = \"\", \"\", VLOOKUP(A30,Master!$B$91:$AC$115,COLUMN(Master!$AC$1)-1,FALSE))","v":"Use and/or disposal"}]
["Constructed Wetland: Free-Water Surface",{"$f":"IF(A31 = \"\", \"\", VLOOKUP(A31,Master!$B$91:$AC$115,COLUMN(Master!$Q$1)-1,FALSE))","v":"Offsite"},{"$f":"IF(A31 = \"\", \"\", VLOOKUP(A31,Master!$B$91:$AC$115,COLUMN(Master!$Y$1)-1,FALSE))","v":"Effluent, Stormwater "},{"$f":"IF(A31 = \"\", \"\", VLOOKUP(A31,Master!$B$91:$AC$115,COLUMN(Master!$Z$1)-1,FALSE))","v":"Effluent, Biomass"},{"$f":"IF(A31 = \"\", \"\", VLOOKUP(A31,Master!$B$91:$AC$115,COLUMN(Master!$AA$1)-1,FALSE))","v":"None"},{"$f":"IF(A31 = \"\", \"\", VLOOKUP(A31,Master!$B$91:$AC$115,COLUMN(Master!$AB$1)-1,FALSE))","v":"Open source"},{"$f":"IF(A31 = \"\", \"\", VLOOKUP(A31,Master!$B$91:$AC$115,COLUMN(Master!$AC$1)-1,FALSE))","v":"Use and/or disposal"}]
["Constructed Wetland: Horizontal Subsurface Flow ",{"$f":"IF(A32 = \"\", \"\", VLOOKUP(A32,Master!$B$91:$AC$115,COLUMN(Master!$Q$1)-1,FALSE))","v":"Offsite"},{"$f":"IF(A32 = \"\", \"\", VLOOKUP(A32,Master!$B$91:$AC$115,COLUMN(Master!$Y$1)-1,FALSE))","v":"Effluent, Blackwater, Brownwater, Greywater"},{"$f":"IF(A32 = \"\", \"\", VLOOKUP(A32,Master!$B$91:$AC$115,COLUMN(Master!$Z$1)-1,FALSE))","v":"Effluent, Biomass"},{"$f":"IF(A32 = \"\", \"\", VLOOKUP(A32,Master!$B$91:$AC$115,COLUMN(Master!$AA$1)-1,FALSE))","v":"None"},{"$f":"IF(A32 = \"\", \"\", VLOOKUP(A32,Master!$B$91:$AC$115,COLUMN(Master!$AB$1)-1,FALSE))","v":"Open source"},{"$f":"IF(A32 = \"\", \"\", VLOOKUP(A32,Master!$B$91:$AC$115,COLUMN(Master!$AC$1)-1,FALSE))","v":"Use and/or disposal"}]
["Constructed Wetland: Vertical Flow ",{"$f":"IF(A33 = \"\", \"\", VLOOKUP(A33,Master!$B$91:$AC$115,COLUMN(Master!$Q$1)-1,FALSE))","v":"Offsite"},{"$f":"IF(A33 = \"\", \"\", VLOOKUP(A33,Master!$B$91:$AC$115,COLUMN(Master!$Y$1)-1,FALSE))","v":"Effluent, Blackwater, Brownwater, Greywater"},{"$f":"IF(A33 = \"\", \"\", VLOOKUP(A33,Master!$B$91:$AC$115,COLUMN(Master!$Z$1)-1,FALSE))","v":"Effluent, Biomass"},{"$f":"IF(A33 = \"\", \"\", VLOOKUP(A33,Master!$B$91:$AC$115,COLUMN(Master!$AA$1)-1,FALSE))","v":"None"},{"$f":"IF(A33 = \"\", \"\", VLOOKUP(A33,Master!$B$91:$AC$115,COLUMN(Master!$AB$1)-1,FALSE))","v":"Open source"},{"$f":"IF(A33 = \"\", \"\", VLOOKUP(A33,Master!$B$91:$AC$115,COLUMN(Master!$AC$1)-1,FALSE))","v":"Use and/or disposal"}]
["Drying Beds: Planted ",{"$f":"IF(A34 = \"\", \"\", VLOOKUP(A34,Master!$B$91:$AC$115,COLUMN(Master!$Q$1)-1,FALSE))","v":"Offsite"},{"$f":"IF(A34 = \"\", \"\", VLOOKUP(A34,Master!$B$91:$AC$115,COLUMN(Master!$Y$1)-1,FALSE))","v":"Sludge"},{"$f":"IF(A34 = \"\", \"\", VLOOKUP(A34,Master!$B$91:$AC$115,COLUMN(Master!$Z$1)-1,FALSE))","v":"Sludge, Effluent"},{"$f":"IF(A34 = \"\", \"\", VLOOKUP(A34,Master!$B$91:$AC$115,COLUMN(Master!$AA$1)-1,FALSE))","v":"Biomass"},{"$f":"IF(A34 = \"\", \"\", VLOOKUP(A34,Master!$B$91:$AC$115,COLUMN(Master!$AB$1)-1,FALSE))","v":"Open source"},{"$f":"IF(A34 = \"\", \"\", VLOOKUP(A34,Master!$B$91:$AC$115,COLUMN(Master!$AC$1)-1,FALSE))","v":"Use and/or disposal"}]
["Drying Beds: Unplanted",{"$f":"IF(A35 = \"\", \"\", VLOOKUP(A35,Master!$B$91:$AC$115,COLUMN(Master!$Q$1)-1,FALSE))","v":"Offsite"},{"$f":"IF(A35 = \"\", \"\", VLOOKUP(A35,Master!$B$91:$AC$115,COLUMN(Master!$Y$1)-1,FALSE))","v":"Sludge"},{"$f":"IF(A35 = \"\", \"\", VLOOKUP(A35,Master!$B$91:$AC$115,COLUMN(Master!$Z$1)-1,FALSE))","v":"Sludge, Effluent"},{"$f":"IF(A35 = \"\", \"\", VLOOKUP(A35,Master!$B$91:$AC$115,COLUMN(Master!$AA$1)-1,FALSE))","v":"None"},{"$f":"IF(A35 = \"\", \"\", VLOOKUP(A35,Master!$B$91:$AC$115,COLUMN(Master!$AB$1)-1,FALSE))","v":"Open source"},{"$f":"IF(A35 = \"\", \"\", VLOOKUP(A35,Master!$B$91:$AC$115,COLUMN(Master!$AC$1)-1,FALSE))","v":"Use and/or disposal"}]
["Flexi Biogas Systems Model BG6",{"$f":"IF(A36 = \"\", \"\", VLOOKUP(A36,Master!$B$91:$AC$115,COLUMN(Master!$Q$1)-1,FALSE))","v":"Offsite"},{"$f":"IF(A36 = \"\", \"\", VLOOKUP(A36,Master!$B$91:$AC$115,COLUMN(Master!$Y$1)-1,FALSE))","v":"Sludge, Organics, Blackwater"},{"$f":"IF(A36 = \"\", \"\", VLOOKUP(A36,Master!$B$91:$AC$115,COLUMN(Master!$Z$1)-1,FALSE))","v":"Sludge"},{"$f":"IF(A36 = \"\", \"\", VLOOKUP(A36,Master!$B$91:$AC$115,COLUMN(Master!$AA$1)-1,FALSE))","v":"Biogas"},{"$f":"IF(A36 = \"\", \"\", VLOOKUP(A36,Master!$B$91:$AC$115,COLUMN(Master!$AB$1)-1,FALSE))","v":"For purchase"},{"$f":"IF(A36 = \"\", \"\", VLOOKUP(A36,Master!$B$91:$AC$115,COLUMN(Master!$AC$1)-1,FALSE))","v":"Use and/or disposal"}]
["Howard-Higgins EcoSan and Waste Management System",{"$f":"IF(A37 = \"\", \"\", VLOOKUP(A37,Master!$B$91:$AC$115,COLUMN(Master!$Q$1)-1,FALSE))","v":"Offsite"},{"$f":"IF(A37 = \"\", \"\", VLOOKUP(A37,Master!$B$91:$AC$115,COLUMN(Master!$Y$1)-1,FALSE))","v":"Sludge, Organics"},{"$f":"IF(A37 = \"\", \"\", VLOOKUP(A37,Master!$B$91:$AC$115,COLUMN(Master!$Z$1)-1,FALSE))","v":"None"},{"$f":"IF(A37 = \"\", \"\", VLOOKUP(A37,Master!$B$91:$AC$115,COLUMN(Master!$AA$1)-1,FALSE))","v":"Compost"},{"$f":"IF(A37 = \"\", \"\", VLOOKUP(A37,Master!$B$91:$AC$115,COLUMN(Master!$AB$1)-1,FALSE))","v":"For purchase"},{"$f":"IF(A37 = \"\", \"\", VLOOKUP(A37,Master!$B$91:$AC$115,COLUMN(Master!$AC$1)-1,FALSE))","v":"Use and/or disposal"}]
["Imhoff Tank",{"$f":"IF(A38 = \"\", \"\", VLOOKUP(A38,Master!$B$91:$AC$115,COLUMN(Master!$Q$1)-1,FALSE))","v":"Offsite"},{"$f":"IF(A38 = \"\", \"\", VLOOKUP(A38,Master!$B$91:$AC$115,COLUMN(Master!$Y$1)-1,FALSE))","v":"Blackwater, Greywater"},{"$f":"IF(A38 = \"\", \"\", VLOOKUP(A38,Master!$B$91:$AC$115,COLUMN(Master!$Z$1)-1,FALSE))","v":"Effluent, Sludge"},{"$f":"IF(A38 = \"\", \"\", VLOOKUP(A38,Master!$B$91:$AC$115,COLUMN(Master!$AA$1)-1,FALSE))","v":"Biogas"},{"$f":"IF(A38 = \"\", \"\", VLOOKUP(A38,Master!$B$91:$AC$115,COLUMN(Master!$AB$1)-1,FALSE))","v":"For purchase"},{"$f":"IF(A38 = \"\", \"\", VLOOKUP(A38,Master!$B$91:$AC$115,COLUMN(Master!$AC$1)-1,FALSE))","v":"Use and/or disposal"}]
["LaDePa (Latrine Dehydration and Pasturization)",{"$f":"IF(A39 = \"\", \"\", VLOOKUP(A39,Master!$B$91:$AC$115,COLUMN(Master!$Q$1)-1,FALSE))","v":"Offsite"},{"$f":"IF(A39 = \"\", \"\", VLOOKUP(A39,Master!$B$91:$AC$115,COLUMN(Master!$Y$1)-1,FALSE))","v":"Sludge"},{"$f":"IF(A39 = \"\", \"\", VLOOKUP(A39,Master!$B$91:$AC$115,COLUMN(Master!$Z$1)-1,FALSE))","v":"Disinfected dried solids"},{"$f":"IF(A39 = \"\", \"\", VLOOKUP(A39,Master!$B$91:$AC$115,COLUMN(Master!$AA$1)-1,FALSE))","v":"None"},{"$f":"IF(A39 = \"\", \"\", VLOOKUP(A39,Master!$B$91:$AC$115,COLUMN(Master!$AB$1)-1,FALSE))","v":"For purchase"},{"$f":"IF(A39 = \"\", \"\", VLOOKUP(A39,Master!$B$91:$AC$115,COLUMN(Master!$AC$1)-1,FALSE))","v":"Use and/or disposal"}]
["Sanivation Solar Charcoal Oven",{"$f":"IF(A40 = \"\", \"\", VLOOKUP(A40,Master!$B$91:$AC$115,COLUMN(Master!$Q$1)-1,FALSE))","v":"Offsite"},{"$f":"IF(A40 = \"\", \"\", VLOOKUP(A40,Master!$B$91:$AC$115,COLUMN(Master!$Y$1)-1,FALSE))","v":"Solid waste, Biochar"},{"$f":"IF(A40 = \"\", \"\", VLOOKUP(A40,Master!$B$91:$AC$115,COLUMN(Master!$Z$1)-1,FALSE))","v":"None"},{"$f":"IF(A40 = \"\", \"\", VLOOKUP(A40,Master!$B$91:$AC$115,COLUMN(Master!$AA$1)-1,FALSE))","v":"Briquettes"},{"$f":"IF(A40 = \"\", \"\", VLOOKUP(A40,Master!$B$91:$AC$115,COLUMN(Master!$AB$1)-1,FALSE))","v":"For purchase"},{"$f":"IF(A40 = \"\", \"\", VLOOKUP(A40,Master!$B$91:$AC$115,COLUMN(Master!$AC$1)-1,FALSE))","v":"Use and/or disposal"}]
["Sedimentation / Thickening Ponds ",{"$f":"IF(A41 = \"\", \"\", VLOOKUP(A41,Master!$B$91:$AC$115,COLUMN(Master!$Q$1)-1,FALSE))","v":"Offsite"},{"$f":"IF(A41 = \"\", \"\", VLOOKUP(A41,Master!$B$91:$AC$115,COLUMN(Master!$Y$1)-1,FALSE))","v":"Sludge"},{"$f":"IF(A41 = \"\", \"\", VLOOKUP(A41,Master!$B$91:$AC$115,COLUMN(Master!$Z$1)-1,FALSE))","v":"Sludge, Effluent"},{"$f":"IF(A41 = \"\", \"\", VLOOKUP(A41,Master!$B$91:$AC$115,COLUMN(Master!$AA$1)-1,FALSE))","v":"None"},{"$f":"IF(A41 = \"\", \"\", VLOOKUP(A41,Master!$B$91:$AC$115,COLUMN(Master!$AB$1)-1,FALSE))","v":"Open source"},{"$f":"IF(A41 = \"\", \"\", VLOOKUP(A41,Master!$B$91:$AC$115,COLUMN(Master!$AC$1)-1,FALSE))","v":"Use and/or disposal"}]
["Settler",{"$f":"IF(A42 = \"\", \"\", VLOOKUP(A42,Master!$B$91:$AC$115,COLUMN(Master!$Q$1)-1,FALSE))","v":"Offsite"},{"$f":"IF(A42 = \"\", \"\", VLOOKUP(A42,Master!$B$91:$AC$115,COLUMN(Master!$Y$1)-1,FALSE))","v":"Blackwater, Brownwater, Greywater"},{"$f":"IF(A42 = \"\", \"\", VLOOKUP(A42,Master!$B$91:$AC$115,COLUMN(Master!$Z$1)-1,FALSE))","v":"Effluent, Sludge"},{"$f":"IF(A42 = \"\", \"\", VLOOKUP(A42,Master!$B$91:$AC$115,COLUMN(Master!$AA$1)-1,FALSE))","v":"None"},{"$f":"IF(A42 = \"\", \"\", VLOOKUP(A42,Master!$B$91:$AC$115,COLUMN(Master!$AB$1)-1,FALSE))","v":"Open source"},{"$f":"IF(A42 = \"\", \"\", VLOOKUP(A42,Master!$B$91:$AC$115,COLUMN(Master!$AC$1)-1,FALSE))","v":"Use and/or disposal"}]
["Solar Sludge Oven ",{"$f":"IF(A43 = \"\", \"\", VLOOKUP(A43,Master!$B$91:$AC$115,COLUMN(Master!$Q$1)-1,FALSE))","v":"Offsite"},{"$f":"IF(A43 = \"\", \"\", VLOOKUP(A43,Master!$B$91:$AC$115,COLUMN(Master!$Y$1)-1,FALSE))","v":"Sludge"},{"$f":"IF(A43 = \"\", \"\", VLOOKUP(A43,Master!$B$91:$AC$115,COLUMN(Master!$Z$1)-1,FALSE))","v":"Disinfected dried solids"},{"$f":"IF(A43 = \"\", \"\", VLOOKUP(A43,Master!$B$91:$AC$115,COLUMN(Master!$AA$1)-1,FALSE))","v":"None"},{"$f":"IF(A43 = \"\", \"\", VLOOKUP(A43,Master!$B$91:$AC$115,COLUMN(Master!$AB$1)-1,FALSE))","v":"In development"},{"$f":"IF(A43 = \"\", \"\", VLOOKUP(A43,Master!$B$91:$AC$115,COLUMN(Master!$AC$1)-1,FALSE))","v":"Use and/or disposal"}]
["Trickling Filter",{"$f":"IF(A44 = \"\", \"\", VLOOKUP(A44,Master!$B$91:$AC$115,COLUMN(Master!$Q$1)-1,FALSE))","v":"Offsite"},{"$f":"IF(A44 = \"\", \"\", VLOOKUP(A44,Master!$B$91:$AC$115,COLUMN(Master!$Y$1)-1,FALSE))","v":"Sludge"},{"$f":"IF(A44 = \"\", \"\", VLOOKUP(A44,Master!$B$91:$AC$115,COLUMN(Master!$Z$1)-1,FALSE))","v":"Effluent, Sludge"},{"$f":"IF(A44 = \"\", \"\", VLOOKUP(A44,Master!$B$91:$AC$115,COLUMN(Master!$AA$1)-1,FALSE))","v":"None"},{"$f":"IF(A44 = \"\", \"\", VLOOKUP(A44,Master!$B$91:$AC$115,COLUMN(Master!$AB$1)-1,FALSE))","v":"For purchase"},{"$f":"IF(A44 = \"\", \"\", VLOOKUP(A44,Master!$B$91:$AC$115,COLUMN(Master!$AC$1)-1,FALSE))","v":"Use and/or disposal"}]
["Upflow Anaerobic Sludge Blanket Reactor ",{"$f":"IF(A45 = \"\", \"\", VLOOKUP(A45,Master!$B$91:$AC$115,COLUMN(Master!$Q$1)-1,FALSE))","v":"Offsite"},{"$f":"IF(A45 = \"\", \"\", VLOOKUP(A45,Master!$B$91:$AC$115,COLUMN(Master!$Y$1)-1,FALSE))","v":"Blackwater, Greywater"},{"$f":"IF(A45 = \"\", \"\", VLOOKUP(A45,Master!$B$91:$AC$115,COLUMN(Master!$Z$1)-1,FALSE))","v":"Effluent, Sludge"},{"$f":"IF(A45 = \"\", \"\", VLOOKUP(A45,Master!$B$91:$AC$115,COLUMN(Master!$AA$1)-1,FALSE))","v":"Biogas"},{"$f":"IF(A45 = \"\", \"\", VLOOKUP(A45,Master!$B$91:$AC$115,COLUMN(Master!$AB$1)-1,FALSE))","v":"For purchase"},{"$f":"IF(A45 = \"\", \"\", VLOOKUP(A45,Master!$B$91:$AC$115,COLUMN(Master!$AC$1)-1,FALSE))","v":"Use and/or disposal"}]
["Waste Stabilization Ponds",{"$f":"IF(A46 = \"\", \"\", VLOOKUP(A46,Master!$B$91:$AC$115,COLUMN(Master!$Q$1)-1,FALSE))","v":"Offsite"},{"$f":"IF(A46 = \"\", \"\", VLOOKUP(A46,Master!$B$91:$AC$115,COLUMN(Master!$Y$1)-1,FALSE))","v":"Blackwater, Greywater"},{"$f":"IF(A46 = \"\", \"\", VLOOKUP(A46,Master!$B$91:$AC$115,COLUMN(Master!$Z$1)-1,FALSE))","v":"Effluent, Sludge"},{"$f":"IF(A46 = \"\", \"\", VLOOKUP(A46,Master!$B$91:$AC$115,COLUMN(Master!$AA$1)-1,FALSE))","v":"None"},{"$f":"IF(A46 = \"\", \"\", VLOOKUP(A46,Master!$B$91:$AC$115,COLUMN(Master!$AB$1)-1,FALSE))","v":"Open source"},{"$f":"IF(A46 = \"\", \"\", VLOOKUP(A46,Master!$B$91:$AC$115,COLUMN(Master!$AC$1)-1,FALSE))","v":"Use and/or disposal"}]
[null,{"$f":"IF(A47 = \"\", \"\", VLOOKUP(A47,Master!$B$91:$AC$114,COLUMN(Master!$Q$1)-1,FALSE))","v":""},{"$f":"IF(A47 = \"\", \"\", VLOOKUP(A47,Master!$B$91:$AC$114,COLUMN(Master!$Y$1)-1,FALSE))","v":""},{"$f":"IF(A47 = \"\", \"\", VLOOKUP(A47,Master!$B$91:$AC$114,COLUMN(Master!$Z$1)-1,FALSE))","v":""},{"$f":"IF(A47 = \"\", \"\", VLOOKUP(A47,Master!$B$91:$AC$114,COLUMN(Master!$AA$1)-1,FALSE))","v":""},{"$f":"IF(A47 = \"\", \"\", VLOOKUP(A47,Master!$B$91:$AC$114,COLUMN(Master!$AB$1)-1,FALSE))","v":""},{"$f":"IF(A47 = \"\", \"\", VLOOKUP(A47,Master!$B$91:$AC$114,COLUMN(Master!$AC$1)-1,FALSE))","v":""}]
[null,{"$f":"IF(A48 = \"\", \"\", VLOOKUP(A48,Master!$B$91:$AC$114,COLUMN(Master!$Q$1)-1,FALSE))","v":""},{"$f":"IF(A48 = \"\", \"\", VLOOKUP(A48,Master!$B$91:$AC$114,COLUMN(Master!$Y$1)-1,FALSE))","v":""},{"$f":"IF(A48 = \"\", \"\", VLOOKUP(A48,Master!$B$91:$AC$114,COLUMN(Master!$Z$1)-1,FALSE))","v":""},{"$f":"IF(A48 = \"\", \"\", VLOOKUP(A48,Master!$B$91:$AC$114,COLUMN(Master!$AA$1)-1,FALSE))","v":""},{"$f":"IF(A48 = \"\", \"\", VLOOKUP(A48,Master!$B$91:$AC$114,COLUMN(Master!$AB$1)-1,FALSE))","v":""},{"$f":"IF(A48 = \"\", \"\", VLOOKUP(A48,Master!$B$91:$AC$114,COLUMN(Master!$AC$1)-1,FALSE))","v":""}]
[null,{"$f":"IF(A49 = \"\", \"\", VLOOKUP(A49,Master!$B$91:$AC$114,COLUMN(Master!$Q$1)-1,FALSE))","v":""},{"$f":"IF(A49 = \"\", \"\", VLOOKUP(A49,Master!$B$91:$AC$114,COLUMN(Master!$Y$1)-1,FALSE))","v":""},{"$f":"IF(A49 = \"\", \"\", VLOOKUP(A49,Master!$B$91:$AC$114,COLUMN(Master!$Z$1)-1,FALSE))","v":""},{"$f":"IF(A49 = \"\", \"\", VLOOKUP(A49,Master!$B$91:$AC$114,COLUMN(Master!$AA$1)-1,FALSE))","v":""},{"$f":"IF(A49 = \"\", \"\", VLOOKUP(A49,Master!$B$91:$AC$114,COLUMN(Master!$AB$1)-1,FALSE))","v":""},{"$f":"IF(A49 = \"\", \"\", VLOOKUP(A49,Master!$B$91:$AC$114,COLUMN(Master!$AC$1)-1,FALSE))","v":""}]
[null,{"$f":"IF(A50 = \"\", \"\", VLOOKUP(A50,Master!$B$91:$AC$114,COLUMN(Master!$Q$1)-1,FALSE))","v":""},{"$f":"IF(A50 = \"\", \"\", VLOOKUP(A50,Master!$B$91:$AC$114,COLUMN(Master!$Y$1)-1,FALSE))","v":""},{"$f":"IF(A50 = \"\", \"\", VLOOKUP(A50,Master!$B$91:$AC$114,COLUMN(Master!$Z$1)-1,FALSE))","v":""},{"$f":"IF(A50 = \"\", \"\", VLOOKUP(A50,Master!$B$91:$AC$114,COLUMN(Master!$AA$1)-1,FALSE))","v":""},{"$f":"IF(A50 = \"\", \"\", VLOOKUP(A50,Master!$B$91:$AC$114,COLUMN(Master!$AB$1)-1,FALSE))","v":""},{"$f":"IF(A50 = \"\", \"\", VLOOKUP(A50,Master!$B$91:$AC$114,COLUMN(Master!$AC$1)-1,FALSE))","v":""}]
[null,{"$f":"IF(A51 = \"\", \"\", VLOOKUP(A51,Master!$B$91:$AC$114,COLUMN(Master!$Q$1)-1,FALSE))","v":""},{"$f":"IF(A51 = \"\", \"\", VLOOKUP(A51,Master!$B$91:$AC$114,COLUMN(Master!$Y$1)-1,FALSE))","v":""},{"$f":"IF(A51 = \"\", \"\", VLOOKUP(A51,Master!$B$91:$AC$114,COLUMN(Master!$Z$1)-1,FALSE))","v":""},{"$f":"IF(A51 = \"\", \"\", VLOOKUP(A51,Master!$B$91:$AC$114,COLUMN(Master!$AA$1)-1,FALSE))","v":""},{"$f":"IF(A51 = \"\", \"\", VLOOKUP(A51,Master!$B$91:$AC$114,COLUMN(Master!$AB$1)-1,FALSE))","v":""},{"$f":"IF(A51 = \"\", \"\", VLOOKUP(A51,Master!$B$91:$AC$114,COLUMN(Master!$AC$1)-1,FALSE))","v":""}]
[null,{"$f":"IF(A52 = \"\", \"\", VLOOKUP(A52,Master!$B$91:$AC$114,COLUMN(Master!$Q$1)-1,FALSE))","v":""},{"$f":"IF(A52 = \"\", \"\", VLOOKUP(A52,Master!$B$91:$AC$114,COLUMN(Master!$Y$1)-1,FALSE))","v":""},{"$f":"IF(A52 = \"\", \"\", VLOOKUP(A52,Master!$B$91:$AC$114,COLUMN(Master!$Z$1)-1,FALSE))","v":""},{"$f":"IF(A52 = \"\", \"\", VLOOKUP(A52,Master!$B$91:$AC$114,COLUMN(Master!$AA$1)-1,FALSE))","v":""},{"$f":"IF(A52 = \"\", \"\", VLOOKUP(A52,Master!$B$91:$AC$114,COLUMN(Master!$AB$1)-1,FALSE))","v":""},{"$f":"IF(A52 = \"\", \"\", VLOOKUP(A52,Master!$B$91:$AC$114,COLUMN(Master!$AC$1)-1,FALSE))","v":""}]
[null,{"$f":"IF(A53 = \"\", \"\", VLOOKUP(A53,Master!$B$91:$AC$114,COLUMN(Master!$Q$1)-1,FALSE))","v":""},{"$f":"IF(A53 = \"\", \"\", VLOOKUP(A53,Master!$B$91:$AC$114,COLUMN(Master!$Y$1)-1,FALSE))","v":""},{"$f":"IF(A53 = \"\", \"\", VLOOKUP(A53,Master!$B$91:$AC$114,COLUMN(Master!$Z$1)-1,FALSE))","v":""},{"$f":"IF(A53 = \"\", \"\", VLOOKUP(A53,Master!$B$91:$AC$114,COLUMN(Master!$AA$1)-1,FALSE))","v":""},{"$f":"IF(A53 = \"\", \"\", VLOOKUP(A53,Master!$B$91:$AC$114,COLUMN(Master!$AB$1)-1,FALSE))","v":""},{"$f":"IF(A53 = \"\", \"\", VLOOKUP(A53,Master!$B$91:$AC$114,COLUMN(Master!$AC$1)-1,FALSE))","v":""}]
[null,{"$f":"IF(A54 = \"\", \"\", VLOOKUP(A54,Master!$B$91:$AC$114,COLUMN(Master!$Q$1)-1,FALSE))","v":""},{"$f":"IF(A54 = \"\", \"\", VLOOKUP(A54,Master!$B$91:$AC$114,COLUMN(Master!$Y$1)-1,FALSE))","v":""},{"$f":"IF(A54 = \"\", \"\", VLOOKUP(A54,Master!$B$91:$AC$114,COLUMN(Master!$Z$1)-1,FALSE))","v":""},{"$f":"IF(A54 = \"\", \"\", VLOOKUP(A54,Master!$B$91:$AC$114,COLUMN(Master!$AA$1)-1,FALSE))","v":""},{"$f":"IF(A54 = \"\", \"\", VLOOKUP(A54,Master!$B$91:$AC$114,COLUMN(Master!$AB$1)-1,FALSE))","v":""},{"$f":"IF(A54 = \"\", \"\", VLOOKUP(A54,Master!$B$91:$AC$114,COLUMN(Master!$AC$1)-1,FALSE))","v":""}]
[null,{"$f":"IF(A55 = \"\", \"\", VLOOKUP(A55,Master!$B$91:$AC$114,COLUMN(Master!$Q$1)-1,FALSE))","v":""},{"$f":"IF(A55 = \"\", \"\", VLOOKUP(A55,Master!$B$91:$AC$114,COLUMN(Master!$Y$1)-1,FALSE))","v":""},{"$f":"IF(A55 = \"\", \"\", VLOOKUP(A55,Master!$B$91:$AC$114,COLUMN(Master!$Z$1)-1,FALSE))","v":""},{"$f":"IF(A55 = \"\", \"\", VLOOKUP(A55,Master!$B$91:$AC$114,COLUMN(Master!$AA$1)-1,FALSE))","v":""},{"$f":"IF(A55 = \"\", \"\", VLOOKUP(A55,Master!$B$91:$AC$114,COLUMN(Master!$AB$1)-1,FALSE))","v":""},{"$f":"IF(A55 = \"\", \"\", VLOOKUP(A55,Master!$B$91:$AC$114,COLUMN(Master!$AC$1)-1,FALSE))","v":""}]
[null,{"$f":"IF(A56 = \"\", \"\", VLOOKUP(A56,Master!$B$91:$AC$114,COLUMN(Master!$Q$1)-1,FALSE))","v":""},{"$f":"IF(A56 = \"\", \"\", VLOOKUP(A56,Master!$B$91:$AC$114,COLUMN(Master!$Y$1)-1,FALSE))","v":""},{"$f":"IF(A56 = \"\", \"\", VLOOKUP(A56,Master!$B$91:$AC$114,COLUMN(Master!$Z$1)-1,FALSE))","v":""},{"$f":"IF(A56 = \"\", \"\", VLOOKUP(A56,Master!$B$91:$AC$114,COLUMN(Master!$AA$1)-1,FALSE))","v":""},{"$f":"IF(A56 = \"\", \"\", VLOOKUP(A56,Master!$B$91:$AC$114,COLUMN(Master!$AB$1)-1,FALSE))","v":""},{"$f":"IF(A56 = \"\", \"\", VLOOKUP(A56,Master!$B$91:$AC$114,COLUMN(Master!$AC$1)-1,FALSE))","v":""}]
[null,{"$f":"IF(A57 = \"\", \"\", VLOOKUP(A57,Master!$B$91:$AC$114,COLUMN(Master!$Q$1)-1,FALSE))","v":""},{"$f":"IF(A57 = \"\", \"\", VLOOKUP(A57,Master!$B$91:$AC$114,COLUMN(Master!$Y$1)-1,FALSE))","v":""},{"$f":"IF(A57 = \"\", \"\", VLOOKUP(A57,Master!$B$91:$AC$114,COLUMN(Master!$Z$1)-1,FALSE))","v":""},{"$f":"IF(A57 = \"\", \"\", VLOOKUP(A57,Master!$B$91:$AC$114,COLUMN(Master!$AA$1)-1,FALSE))","v":""},{"$f":"IF(A57 = \"\", \"\", VLOOKUP(A57,Master!$B$91:$AC$114,COLUMN(Master!$AB$1)-1,FALSE))","v":""},{"$f":"IF(A57 = \"\", \"\", VLOOKUP(A57,Master!$B$91:$AC$114,COLUMN(Master!$AC$1)-1,FALSE))","v":""}]
[null,{"$f":"IF(A58 = \"\", \"\", VLOOKUP(A58,Master!$B$91:$AC$114,COLUMN(Master!$Q$1)-1,FALSE))","v":""},{"$f":"IF(A58 = \"\", \"\", VLOOKUP(A58,Master!$B$91:$AC$114,COLUMN(Master!$Y$1)-1,FALSE))","v":""},{"$f":"IF(A58 = \"\", \"\", VLOOKUP(A58,Master!$B$91:$AC$114,COLUMN(Master!$Z$1)-1,FALSE))","v":""},{"$f":"IF(A58 = \"\", \"\", VLOOKUP(A58,Master!$B$91:$AC$114,COLUMN(Master!$AA$1)-1,FALSE))","v":""},{"$f":"IF(A58 = \"\", \"\", VLOOKUP(A58,Master!$B$91:$AC$114,COLUMN(Master!$AB$1)-1,FALSE))","v":""},{"$f":"IF(A58 = \"\", \"\", VLOOKUP(A58,Master!$B$91:$AC$114,COLUMN(Master!$AC$1)-1,FALSE))","v":""}]
[null,{"$f":"IF(A59 = \"\", \"\", VLOOKUP(A59,Master!$B$91:$AC$114,COLUMN(Master!$Q$1)-1,FALSE))","v":""},{"$f":"IF(A59 = \"\", \"\", VLOOKUP(A59,Master!$B$91:$AC$114,COLUMN(Master!$Y$1)-1,FALSE))","v":""},{"$f":"IF(A59 = \"\", \"\", VLOOKUP(A59,Master!$B$91:$AC$114,COLUMN(Master!$Z$1)-1,FALSE))","v":""},{"$f":"IF(A59 = \"\", \"\", VLOOKUP(A59,Master!$B$91:$AC$114,COLUMN(Master!$AA$1)-1,FALSE))","v":""},{"$f":"IF(A59 = \"\", \"\", VLOOKUP(A59,Master!$B$91:$AC$114,COLUMN(Master!$AB$1)-1,FALSE))","v":""},{"$f":"IF(A59 = \"\", \"\", VLOOKUP(A59,Master!$B$91:$AC$114,COLUMN(Master!$AC$1)-1,FALSE))","v":""}]
[null,{"$f":"IF(A60 = \"\", \"\", VLOOKUP(A60,Master!$B$91:$AC$114,COLUMN(Master!$Q$1)-1,FALSE))","v":""},{"$f":"IF(A60 = \"\", \"\", VLOOKUP(A60,Master!$B$91:$AC$114,COLUMN(Master!$Y$1)-1,FALSE))","v":""},{"$f":"IF(A60 = \"\", \"\", VLOOKUP(A60,Master!$B$91:$AC$114,COLUMN(Master!$Z$1)-1,FALSE))","v":""},{"$f":"IF(A60 = \"\", \"\", VLOOKUP(A60,Master!$B$91:$AC$114,COLUMN(Master!$AA$1)-1,FALSE))","v":""},{"$f":"IF(A60 = \"\", \"\", VLOOKUP(A60,Master!$B$91:$AC$114,COLUMN(Master!$AB$1)-1,FALSE))","v":""},{"$f":"IF(A60 = \"\", \"\", VLOOKUP(A60,Master!$B$91:$AC$114,COLUMN(Master!$AC$1)-1,FALSE))","v":""}]
[null,{"$f":"IF(A61 = \"\", \"\", VLOOKUP(A61,Master!$B$91:$AC$114,COLUMN(Master!$Q$1)-1,FALSE))","v":""},{"$f":"IF(A61 = \"\", \"\", VLOOKUP(A61,Master!$B$91:$AC$114,COLUMN(Master!$Y$1)-1,FALSE))","v":""},null,{"$f":"IF(A61 = \"\", \"\", VLOOKUP(A61,Master!$B$91:$AC$114,COLUMN(Master!$AA$1)-1,FALSE))","v":""},{"$f":"IF(A61 = \"\", \"\", VLOOKUP(A61,Master!$B$91:$AC$114,COLUMN(Master!$AB$1)-1,FALSE))","v":""}]
[null,{"$f":"IF(A62 = \"\", \"\", VLOOKUP(A62,Master!$B$91:$AC$114,COLUMN(Master!$Q$1)-1,FALSE))","v":""},{"$f":"IF(A62 = \"\", \"\", VLOOKUP(A62,Master!$B$91:$AC$114,COLUMN(Master!$Y$1)-1,FALSE))","v":""},null,{"$f":"IF(A62 = \"\", \"\", VLOOKUP(A62,Master!$B$91:$AC$114,COLUMN(Master!$AA$1)-1,FALSE))","v":""},{"$f":"IF(A62 = \"\", \"\", VLOOKUP(A62,Master!$B$91:$AC$114,COLUMN(Master!$AB$1)-1,FALSE))","v":""}]
[null,{"$f":"IF(A63 = \"\", \"\", VLOOKUP(A63,Master!$B$91:$AC$114,COLUMN(Master!$Q$1)-1,FALSE))","v":""},{"$f":"IF(A63 = \"\", \"\", VLOOKUP(A63,Master!$B$91:$AC$114,COLUMN(Master!$Y$1)-1,FALSE))","v":""},null,{"$f":"IF(A63 = \"\", \"\", VLOOKUP(A63,Master!$B$91:$AC$114,COLUMN(Master!$AA$1)-1,FALSE))","v":""},{"$f":"IF(A63 = \"\", \"\", VLOOKUP(A63,Master!$B$91:$AC$114,COLUMN(Master!$AB$1)-1,FALSE))","v":""}]
[null,{"$f":"IF(A64 = \"\", \"\", VLOOKUP(A64,Master!$B$91:$AC$114,COLUMN(Master!$Q$1)-1,FALSE))","v":""},{"$f":"IF(A64 = \"\", \"\", VLOOKUP(A64,Master!$B$91:$AC$114,COLUMN(Master!$Y$1)-1,FALSE))","v":""},null,{"$f":"IF(A64 = \"\", \"\", VLOOKUP(A64,Master!$B$91:$AC$114,COLUMN(Master!$AA$1)-1,FALSE))","v":""},{"$f":"IF(A64 = \"\", \"\", VLOOKUP(A64,Master!$B$91:$AC$114,COLUMN(Master!$AB$1)-1,FALSE))","v":""}]
[null,{"$f":"IF(A65 = \"\", \"\", VLOOKUP(A65,Master!$B$91:$AC$114,COLUMN(Master!$Q$1)-1,FALSE))","v":""},{"$f":"IF(A65 = \"\", \"\", VLOOKUP(A65,Master!$B$91:$AC$114,COLUMN(Master!$Y$1)-1,FALSE))","v":""},null,{"$f":"IF(A65 = \"\", \"\", VLOOKUP(A65,Master!$B$91:$AC$114,COLUMN(Master!$AA$1)-1,FALSE))","v":""},{"$f":"IF(A65 = \"\", \"\", VLOOKUP(A65,Master!$B$91:$AC$114,COLUMN(Master!$AB$1)-1,FALSE))","v":""}]
[null,{"$f":"IF(A66 = \"\", \"\", VLOOKUP(A66,Master!$B$91:$AC$114,COLUMN(Master!$Q$1)-1,FALSE))","v":""},{"$f":"IF(A66 = \"\", \"\", VLOOKUP(A66,Master!$B$91:$AC$114,COLUMN(Master!$Y$1)-1,FALSE))","v":""},null,{"$f":"IF(A66 = \"\", \"\", VLOOKUP(A66,Master!$B$91:$AC$114,COLUMN(Master!$AA$1)-1,FALSE))","v":""},{"$f":"IF(A66 = \"\", \"\", VLOOKUP(A66,Master!$B$91:$AC$114,COLUMN(Master!$AB$1)-1,FALSE))","v":""}]
[null,{"$f":"IF(A67 = \"\", \"\", VLOOKUP(A67,Master!$B$91:$AC$114,COLUMN(Master!$Q$1)-1,FALSE))","v":""},{"$f":"IF(A67 = \"\", \"\", VLOOKUP(A67,Master!$B$91:$AC$114,COLUMN(Master!$Y$1)-1,FALSE))","v":""},null,{"$f":"IF(A67 = \"\", \"\", VLOOKUP(A67,Master!$B$91:$AC$114,COLUMN(Master!$AA$1)-1,FALSE))","v":""},{"$f":"IF(A67 = \"\", \"\", VLOOKUP(A67,Master!$B$91:$AC$114,COLUMN(Master!$AB$1)-1,FALSE))","v":""}]
[null,{"$f":"IF(A68 = \"\", \"\", VLOOKUP(A68,Master!$B$91:$AC$114,COLUMN(Master!$Q$1)-1,FALSE))","v":""},{"$f":"IF(A68 = \"\", \"\", VLOOKUP(A68,Master!$B$91:$AC$114,COLUMN(Master!$Y$1)-1,FALSE))","v":""},null,{"$f":"IF(A68 = \"\", \"\", VLOOKUP(A68,Master!$B$91:$AC$114,COLUMN(Master!$AA$1)-1,FALSE))","v":""},{"$f":"IF(A68 = \"\", \"\", VLOOKUP(A68,Master!$B$91:$AC$114,COLUMN(Master!$AB$1)-1,FALSE))","v":""}]
[null,{"$f":"IF(A69 = \"\", \"\", VLOOKUP(A69,Master!$B$91:$AC$114,COLUMN(Master!$Q$1)-1,FALSE))","v":""},{"$f":"IF(A69 = \"\", \"\", VLOOKUP(A69,Master!$B$91:$AC$114,COLUMN(Master!$Y$1)-1,FALSE))","v":""},null,{"$f":"IF(A69 = \"\", \"\", VLOOKUP(A69,Master!$B$91:$AC$114,COLUMN(Master!$AA$1)-1,FALSE))","v":""},{"$f":"IF(A69 = \"\", \"\", VLOOKUP(A69,Master!$B$91:$AC$114,COLUMN(Master!$AB$1)-1,FALSE))","v":""}]
[null,{"$f":"IF(A70 = \"\", \"\", VLOOKUP(A70,Master!$B$91:$AC$114,COLUMN(Master!$Q$1)-1,FALSE))","v":""},{"$f":"IF(A70 = \"\", \"\", VLOOKUP(A70,Master!$B$91:$AC$114,COLUMN(Master!$Y$1)-1,FALSE))","v":""},null,{"$f":"IF(A70 = \"\", \"\", VLOOKUP(A70,Master!$B$91:$AC$114,COLUMN(Master!$AA$1)-1,FALSE))","v":""},{"$f":"IF(A70 = \"\", \"\", VLOOKUP(A70,Master!$B$91:$AC$114,COLUMN(Master!$AB$1)-1,FALSE))","v":""}]
[null,{"$f":"IF(A71 = \"\", \"\", VLOOKUP(A71,Master!$B$91:$AC$114,COLUMN(Master!$Q$1)-1,FALSE))","v":""},{"$f":"IF(A71 = \"\", \"\", VLOOKUP(A71,Master!$B$91:$AC$114,COLUMN(Master!$Y$1)-1,FALSE))","v":""},null,{"$f":"IF(A71 = \"\", \"\", VLOOKUP(A71,Master!$B$91:$AC$114,COLUMN(Master!$AA$1)-1,FALSE))","v":""},{"$f":"IF(A71 = \"\", \"\", VLOOKUP(A71,Master!$B$91:$AC$114,COLUMN(Master!$AB$1)-1,FALSE))","v":""}]
[null,{"$f":"IF(A72 = \"\", \"\", VLOOKUP(A72,Master!$B$91:$AC$114,COLUMN(Master!$Q$1)-1,FALSE))","v":""},{"$f":"IF(A72 = \"\", \"\", VLOOKUP(A72,Master!$B$91:$AC$114,COLUMN(Master!$Y$1)-1,FALSE))","v":""},null,{"$f":"IF(A72 = \"\", \"\", VLOOKUP(A72,Master!$B$91:$AC$114,COLUMN(Master!$AA$1)-1,FALSE))","v":""},{"$f":"IF(A72 = \"\", \"\", VLOOKUP(A72,Master!$B$91:$AC$114,COLUMN(Master!$AB$1)-1,FALSE))","v":""}]
[null,{"$f":"IF(A73 = \"\", \"\", VLOOKUP(A73,Master!$B$91:$AC$114,COLUMN(Master!$Q$1)-1,FALSE))","v":""},{"$f":"IF(A73 = \"\", \"\", VLOOKUP(A73,Master!$B$91:$AC$114,COLUMN(Master!$Y$1)-1,FALSE))","v":""},null,{"$f":"IF(A73 = \"\", \"\", VLOOKUP(A73,Master!$B$91:$AC$114,COLUMN(Master!$AA$1)-1,FALSE))","v":""},{"$f":"IF(A73 = \"\", \"\", VLOOKUP(A73,Master!$B$91:$AC$114,COLUMN(Master!$AB$1)-1,FALSE))","v":""}]
[null,{"$f":"IF(A74 = \"\", \"\", VLOOKUP(A74,Master!$B$91:$AC$114,COLUMN(Master!$Q$1)-1,FALSE))","v":""},{"$f":"IF(A74 = \"\", \"\", VLOOKUP(A74,Master!$B$91:$AC$114,COLUMN(Master!$Y$1)-1,FALSE))","v":""},null,{"$f":"IF(A74 = \"\", \"\", VLOOKUP(A74,Master!$B$91:$AC$114,COLUMN(Master!$AA$1)-1,FALSE))","v":""},{"$f":"IF(A74 = \"\", \"\", VLOOKUP(A74,Master!$B$91:$AC$114,COLUMN(Master!$AB$1)-1,FALSE))","v":""}]
[null,{"$f":"IF(A75 = \"\", \"\", VLOOKUP(A75,Master!$B$91:$AC$114,COLUMN(Master!$Q$1)-1,FALSE))","v":""},{"$f":"IF(A75 = \"\", \"\", VLOOKUP(A75,Master!$B$91:$AC$114,COLUMN(Master!$Y$1)-1,FALSE))","v":""},null,{"$f":"IF(A75 = \"\", \"\", VLOOKUP(A75,Master!$B$91:$AC$114,COLUMN(Master!$AA$1)-1,FALSE))","v":""},{"$f":"IF(A75 = \"\", \"\", VLOOKUP(A75,Master!$B$91:$AC$114,COLUMN(Master!$AB$1)-1,FALSE))","v":""}]
[null,{"$f":"IF(A76 = \"\", \"\", VLOOKUP(A76,Master!$B$91:$AC$114,COLUMN(Master!$Q$1)-1,FALSE))","v":""},{"$f":"IF(A76 = \"\", \"\", VLOOKUP(A76,Master!$B$91:$AC$114,COLUMN(Master!$Y$1)-1,FALSE))","v":""},null,{"$f":"IF(A76 = \"\", \"\", VLOOKUP(A76,Master!$B$91:$AC$114,COLUMN(Master!$AA$1)-1,FALSE))","v":""},{"$f":"IF(A76 = \"\", \"\", VLOOKUP(A76,Master!$B$91:$AC$114,COLUMN(Master!$AB$1)-1,FALSE))","v":""}]
[null,{"$f":"IF(A77 = \"\", \"\", VLOOKUP(A77,Master!$B$91:$AC$114,COLUMN(Master!$Q$1)-1,FALSE))","v":""},{"$f":"IF(A77 = \"\", \"\", VLOOKUP(A77,Master!$B$91:$AC$114,COLUMN(Master!$Y$1)-1,FALSE))","v":""},null,{"$f":"IF(A77 = \"\", \"\", VLOOKUP(A77,Master!$B$91:$AC$114,COLUMN(Master!$AA$1)-1,FALSE))","v":""},{"$f":"IF(A77 = \"\", \"\", VLOOKUP(A77,Master!$B$91:$AC$114,COLUMN(Master!$AB$1)-1,FALSE))","v":""}]
[null,{"$f":"IF(A78 = \"\", \"\", VLOOKUP(A78,Master!$B$91:$AC$114,COLUMN(Master!$Q$1)-1,FALSE))","v":""},{"$f":"IF(A78 = \"\", \"\", VLOOKUP(A78,Master!$B$91:$AC$114,COLUMN(Master!$Y$1)-1,FALSE))","v":""},null,{"$f":"IF(A78 = \"\", \"\", VLOOKUP(A78,Master!$B$91:$AC$114,COLUMN(Master!$AA$1)-1,FALSE))","v":""},{"$f":"IF(A78 = \"\", \"\", VLOOKUP(A78,Master!$B$91:$AC$114,COLUMN(Master!$AB$1)-1,FALSE))","v":""}]
[null,{"$f":"IF(A79 = \"\", \"\", VLOOKUP(A79,Master!$B$91:$AC$114,COLUMN(Master!$Q$1)-1,FALSE))","v":""},{"$f":"IF(A79 = \"\", \"\", VLOOKUP(A79,Master!$B$91:$AC$114,COLUMN(Master!$Y$1)-1,FALSE))","v":""},null,{"$f":"IF(A79 = \"\", \"\", VLOOKUP(A79,Master!$B$91:$AC$114,COLUMN(Master!$AA$1)-1,FALSE))","v":""},{"$f":"IF(A79 = \"\", \"\", VLOOKUP(A79,Master!$B$91:$AC$114,COLUMN(Master!$AB$1)-1,FALSE))","v":""}]
[null,{"$f":"IF(A80 = \"\", \"\", VLOOKUP(A80,Master!$B$91:$AC$114,COLUMN(Master!$Q$1)-1,FALSE))","v":""},{"$f":"IF(A80 = \"\", \"\", VLOOKUP(A80,Master!$B$91:$AC$114,COLUMN(Master!$Y$1)-1,FALSE))","v":""},null,{"$f":"IF(A80 = \"\", \"\", VLOOKUP(A80,Master!$B$91:$AC$114,COLUMN(Master!$AA$1)-1,FALSE))","v":""},{"$f":"IF(A80 = \"\", \"\", VLOOKUP(A80,Master!$B$91:$AC$114,COLUMN(Master!$AB$1)-1,FALSE))","v":""}]
[null,{"$f":"IF(A81 = \"\", \"\", VLOOKUP(A81,Master!$B$91:$AC$114,COLUMN(Master!$Q$1)-1,FALSE))","v":""},{"$f":"IF(A81 = \"\", \"\", VLOOKUP(A81,Master!$B$91:$AC$114,COLUMN(Master!$Y$1)-1,FALSE))","v":""},null,{"$f":"IF(A81 = \"\", \"\", VLOOKUP(A81,Master!$B$91:$AC$114,COLUMN(Master!$AA$1)-1,FALSE))","v":""},{"$f":"IF(A81 = \"\", \"\", VLOOKUP(A81,Master!$B$91:$AC$114,COLUMN(Master!$AB$1)-1,FALSE))","v":""}]
[null,{"$f":"IF(A82 = \"\", \"\", VLOOKUP(A82,Master!$B$91:$AC$114,COLUMN(Master!$Q$1)-1,FALSE))","v":""},{"$f":"IF(A82 = \"\", \"\", VLOOKUP(A82,Master!$B$91:$AC$114,COLUMN(Master!$Y$1)-1,FALSE))","v":""},null,{"$f":"IF(A82 = \"\", \"\", VLOOKUP(A82,Master!$B$91:$AC$114,COLUMN(Master!$AA$1)-1,FALSE))","v":""},{"$f":"IF(A82 = \"\", \"\", VLOOKUP(A82,Master!$B$91:$AC$114,COLUMN(Master!$AB$1)-1,FALSE))","v":""}]
[null,{"$f":"IF(A83 = \"\", \"\", VLOOKUP(A83,Master!$B$91:$AC$114,COLUMN(Master!$Q$1)-1,FALSE))","v":""},{"$f":"IF(A83 = \"\", \"\", VLOOKUP(A83,Master!$B$91:$AC$114,COLUMN(Master!$Y$1)-1,FALSE))","v":""},null,{"$f":"IF(A83 = \"\", \"\", VLOOKUP(A83,Master!$B$91:$AC$114,COLUMN(Master!$AA$1)-1,FALSE))","v":""},{"$f":"IF(A83 = \"\", \"\", VLOOKUP(A83,Master!$B$91:$AC$114,COLUMN(Master!$AB$1)-1,FALSE))","v":""}]
[null,{"$f":"IF(A84 = \"\", \"\", VLOOKUP(A84,Master!$B$91:$AC$114,COLUMN(Master!$Q$1)-1,FALSE))","v":""},{"$f":"IF(A84 = \"\", \"\", VLOOKUP(A84,Master!$B$91:$AC$114,COLUMN(Master!$Y$1)-1,FALSE))","v":""},null,{"$f":"IF(A84 = \"\", \"\", VLOOKUP(A84,Master!$B$91:$AC$114,COLUMN(Master!$AA$1)-1,FALSE))","v":""},{"$f":"IF(A84 = \"\", \"\", VLOOKUP(A84,Master!$B$91:$AC$114,COLUMN(Master!$AB$1)-1,FALSE))","v":""}]
[null,{"$f":"IF(A85 = \"\", \"\", VLOOKUP(A85,Master!$B$91:$AC$114,COLUMN(Master!$Q$1)-1,FALSE))","v":""},{"$f":"IF(A85 = \"\", \"\", VLOOKUP(A85,Master!$B$91:$AC$114,COLUMN(Master!$Y$1)-1,FALSE))","v":""},null,{"$f":"IF(A85 = \"\", \"\", VLOOKUP(A85,Master!$B$91:$AC$114,COLUMN(Master!$AA$1)-1,FALSE))","v":""},{"$f":"IF(A85 = \"\", \"\", VLOOKUP(A85,Master!$B$91:$AC$114,COLUMN(Master!$AB$1)-1,FALSE))","v":""}]
[null,{"$f":"IF(A86 = \"\", \"\", VLOOKUP(A86,Master!$B$91:$AC$114,COLUMN(Master!$Q$1)-1,FALSE))","v":""},{"$f":"IF(A86 = \"\", \"\", VLOOKUP(A86,Master!$B$91:$AC$114,COLUMN(Master!$Y$1)-1,FALSE))","v":""},null,{"$f":"IF(A86 = \"\", \"\", VLOOKUP(A86,Master!$B$91:$AC$114,COLUMN(Master!$AA$1)-1,FALSE))","v":""},{"$f":"IF(A86 = \"\", \"\", VLOOKUP(A86,Master!$B$91:$AC$114,COLUMN(Master!$AB$1)-1,FALSE))","v":""}]
[null,{"$f":"IF(A87 = \"\", \"\", VLOOKUP(A87,Master!$B$91:$AC$114,COLUMN(Master!$Q$1)-1,FALSE))","v":""},{"$f":"IF(A87 = \"\", \"\", VLOOKUP(A87,Master!$B$91:$AC$114,COLUMN(Master!$Y$1)-1,FALSE))","v":""},null,{"$f":"IF(A87 = \"\", \"\", VLOOKUP(A87,Master!$B$91:$AC$114,COLUMN(Master!$AA$1)-1,FALSE))","v":""},{"$f":"IF(A87 = \"\", \"\", VLOOKUP(A87,Master!$B$91:$AC$114,COLUMN(Master!$AB$1)-1,FALSE))","v":""}]
[null,{"$f":"IF(A88 = \"\", \"\", VLOOKUP(A88,Master!$B$91:$AC$114,COLUMN(Master!$Q$1)-1,FALSE))","v":""},{"$f":"IF(A88 = \"\", \"\", VLOOKUP(A88,Master!$B$91:$AC$114,COLUMN(Master!$Y$1)-1,FALSE))","v":""},null,{"$f":"IF(A88 = \"\", \"\", VLOOKUP(A88,Master!$B$91:$AC$114,COLUMN(Master!$AA$1)-1,FALSE))","v":""},{"$f":"IF(A88 = \"\", \"\", VLOOKUP(A88,Master!$B$91:$AC$114,COLUMN(Master!$AB$1)-1,FALSE))","v":""}]
[null,{"$f":"IF(A89 = \"\", \"\", VLOOKUP(A89,Master!$B$91:$AC$114,COLUMN(Master!$Q$1)-1,FALSE))","v":""},{"$f":"IF(A89 = \"\", \"\", VLOOKUP(A89,Master!$B$91:$AC$114,COLUMN(Master!$Y$1)-1,FALSE))","v":""},null,{"$f":"IF(A89 = \"\", \"\", VLOOKUP(A89,Master!$B$91:$AC$114,COLUMN(Master!$AA$1)-1,FALSE))","v":""},{"$f":"IF(A89 = \"\", \"\", VLOOKUP(A89,Master!$B$91:$AC$114,COLUMN(Master!$AB$1)-1,FALSE))","v":""}]
[null,{"$f":"IF(A90 = \"\", \"\", VLOOKUP(A90,Master!$B$91:$AC$114,COLUMN(Master!$Q$1)-1,FALSE))","v":""},{"$f":"IF(A90 = \"\", \"\", VLOOKUP(A90,Master!$B$91:$AC$114,COLUMN(Master!$Y$1)-1,FALSE))","v":""},null,{"$f":"IF(A90 = \"\", \"\", VLOOKUP(A90,Master!$B$91:$AC$114,COLUMN(Master!$AA$1)-1,FALSE))","v":""},{"$f":"IF(A90 = \"\", \"\", VLOOKUP(A90,Master!$B$91:$AC$114,COLUMN(Master!$AB$1)-1,FALSE))","v":""}]
[null,{"$f":"IF(A91 = \"\", \"\", VLOOKUP(A91,Master!$B$91:$AC$114,COLUMN(Master!$Q$1)-1,FALSE))","v":""},{"$f":"IF(A91 = \"\", \"\", VLOOKUP(A91,Master!$B$91:$AC$114,COLUMN(Master!$Y$1)-1,FALSE))","v":""},null,{"$f":"IF(A91 = \"\", \"\", VLOOKUP(A91,Master!$B$91:$AC$114,COLUMN(Master!$AA$1)-1,FALSE))","v":""},{"$f":"IF(A91 = \"\", \"\", VLOOKUP(A91,Master!$B$91:$AC$114,COLUMN(Master!$AB$1)-1,FALSE))","v":""}]
[null,{"$f":"IF(A92 = \"\", \"\", VLOOKUP(A92,Master!$B$91:$AC$114,COLUMN(Master!$Q$1)-1,FALSE))","v":""},{"$f":"IF(A92 = \"\", \"\", VLOOKUP(A92,Master!$B$91:$AC$114,COLUMN(Master!$Y$1)-1,FALSE))","v":""},null,{"$f":"IF(A92 = \"\", \"\", VLOOKUP(A92,Master!$B$91:$AC$114,COLUMN(Master!$AA$1)-1,FALSE))","v":""},{"$f":"IF(A92 = \"\", \"\", VLOOKUP(A92,Master!$B$91:$AC$114,COLUMN(Master!$AB$1)-1,FALSE))","v":""}]
[null,{"$f":"IF(A93 = \"\", \"\", VLOOKUP(A93,Master!$B$91:$AC$114,COLUMN(Master!$Q$1)-1,FALSE))","v":""},{"$f":"IF(A93 = \"\", \"\", VLOOKUP(A93,Master!$B$91:$AC$114,COLUMN(Master!$Y$1)-1,FALSE))","v":""},null,{"$f":"IF(A93 = \"\", \"\", VLOOKUP(A93,Master!$B$91:$AC$114,COLUMN(Master!$AA$1)-1,FALSE))","v":""},{"$f":"IF(A93 = \"\", \"\", VLOOKUP(A93,Master!$B$91:$AC$114,COLUMN(Master!$AB$1)-1,FALSE))","v":""}]
[null,{"$f":"IF(A94 = \"\", \"\", VLOOKUP(A94,Master!$B$91:$AC$114,COLUMN(Master!$Q$1)-1,FALSE))","v":""},{"$f":"IF(A94 = \"\", \"\", VLOOKUP(A94,Master!$B$91:$AC$114,COLUMN(Master!$Y$1)-1,FALSE))","v":""},null,{"$f":"IF(A94 = \"\", \"\", VLOOKUP(A94,Master!$B$91:$AC$114,COLUMN(Master!$AA$1)-1,FALSE))","v":""},{"$f":"IF(A94 = \"\", \"\", VLOOKUP(A94,Master!$B$91:$AC$114,COLUMN(Master!$AB$1)-1,FALSE))","v":""}]
[null,{"$f":"IF(A95 = \"\", \"\", VLOOKUP(A95,Master!$B$91:$AC$114,COLUMN(Master!$Q$1)-1,FALSE))","v":""},{"$f":"IF(A95 = \"\", \"\", VLOOKUP(A95,Master!$B$91:$AC$114,COLUMN(Master!$Y$1)-1,FALSE))","v":""},null,{"$f":"IF(A95 = \"\", \"\", VLOOKUP(A95,Master!$B$91:$AC$114,COLUMN(Master!$AA$1)-1,FALSE))","v":""},{"$f":"IF(A95 = \"\", \"\", VLOOKUP(A95,Master!$B$91:$AC$114,COLUMN(Master!$AB$1)-1,FALSE))","v":""}]
[null,{"$f":"IF(A96 = \"\", \"\", VLOOKUP(A96,Master!$B$91:$AC$114,COLUMN(Master!$Q$1)-1,FALSE))","v":""},{"$f":"IF(A96 = \"\", \"\", VLOOKUP(A96,Master!$B$91:$AC$114,COLUMN(Master!$Y$1)-1,FALSE))","v":""},null,{"$f":"IF(A96 = \"\", \"\", VLOOKUP(A96,Master!$B$91:$AC$114,COLUMN(Master!$AA$1)-1,FALSE))","v":""},{"$f":"IF(A96 = \"\", \"\", VLOOKUP(A96,Master!$B$91:$AC$114,COLUMN(Master!$AB$1)-1,FALSE))","v":""}]
[null,{"$f":"IF(A97 = \"\", \"\", VLOOKUP(A97,Master!$B$91:$AC$114,COLUMN(Master!$Q$1)-1,FALSE))","v":""},{"$f":"IF(A97 = \"\", \"\", VLOOKUP(A97,Master!$B$91:$AC$114,COLUMN(Master!$Y$1)-1,FALSE))","v":""},null,{"$f":"IF(A97 = \"\", \"\", VLOOKUP(A97,Master!$B$91:$AC$114,COLUMN(Master!$AA$1)-1,FALSE))","v":""},{"$f":"IF(A97 = \"\", \"\", VLOOKUP(A97,Master!$B$91:$AC$114,COLUMN(Master!$AB$1)-1,FALSE))","v":""}]
[null,{"$f":"IF(A98 = \"\", \"\", VLOOKUP(A98,Master!$B$91:$AC$114,COLUMN(Master!$Q$1)-1,FALSE))","v":""},{"$f":"IF(A98 = \"\", \"\", VLOOKUP(A98,Master!$B$91:$AC$114,COLUMN(Master!$Y$1)-1,FALSE))","v":""},null,{"$f":"IF(A98 = \"\", \"\", VLOOKUP(A98,Master!$B$91:$AC$114,COLUMN(Master!$AA$1)-1,FALSE))","v":""},{"$f":"IF(A98 = \"\", \"\", VLOOKUP(A98,Master!$B$91:$AC$114,COLUMN(Master!$AB$1)-1,FALSE))","v":""}]
[null,{"$f":"IF(A99 = \"\", \"\", VLOOKUP(A99,Master!$B$91:$AC$114,COLUMN(Master!$Q$1)-1,FALSE))","v":""},{"$f":"IF(A99 = \"\", \"\", VLOOKUP(A99,Master!$B$91:$AC$114,COLUMN(Master!$Y$1)-1,FALSE))","v":""},null,{"$f":"IF(A99 = \"\", \"\", VLOOKUP(A99,Master!$B$91:$AC$114,COLUMN(Master!$AA$1)-1,FALSE))","v":""},{"$f":"IF(A99 = \"\", \"\", VLOOKUP(A99,Master!$B$91:$AC$114,COLUMN(Master!$AB$1)-1,FALSE))","v":""}]
[null,{"$f":"IF(A100 = \"\", \"\", VLOOKUP(A100,Master!$B$91:$AC$114,COLUMN(Master!$Q$1)-1,FALSE))","v":""},{"$f":"IF(A100 = \"\", \"\", VLOOKUP(A100,Master!$B$91:$AC$114,COLUMN(Master!$Y$1)-1,FALSE))","v":""},null,{"$f":"IF(A100 = \"\", \"\", VLOOKUP(A100,Master!$B$91:$AC$114,COLUMN(Master!$AA$1)-1,FALSE))","v":""},{"$f":"IF(A100 = \"\", \"\", VLOOKUP(A100,Master!$B$91:$AC$114,COLUMN(Master!$AB$1)-1,FALSE))","v":""}]
[null,{"$f":"IF(A101 = \"\", \"\", VLOOKUP(A101,Master!$B$91:$AC$114,COLUMN(Master!$Q$1)-1,FALSE))","v":""},{"$f":"IF(A101 = \"\", \"\", VLOOKUP(A101,Master!$B$91:$AC$114,COLUMN(Master!$Y$1)-1,FALSE))","v":""},null,{"$f":"IF(A101 = \"\", \"\", VLOOKUP(A101,Master!$B$91:$AC$114,COLUMN(Master!$AA$1)-1,FALSE))","v":""},{"$f":"IF(A101 = \"\", \"\", VLOOKUP(A101,Master!$B$91:$AC$114,COLUMN(Master!$AB$1)-1,FALSE))","v":""}]
[null,{"$f":"IF(A102 = \"\", \"\", VLOOKUP(A102,Master!$B$91:$AC$114,COLUMN(Master!$Q$1)-1,FALSE))","v":""},{"$f":"IF(A102 = \"\", \"\", VLOOKUP(A102,Master!$B$91:$AC$114,COLUMN(Master!$Y$1)-1,FALSE))","v":""},null,{"$f":"IF(A102 = \"\", \"\", VLOOKUP(A102,Master!$B$91:$AC$114,COLUMN(Master!$AA$1)-1,FALSE))","v":""},{"$f":"IF(A102 = \"\", \"\", VLOOKUP(A102,Master!$B$91:$AC$114,COLUMN(Master!$AB$1)-1,FALSE))","v":""}]
[null,{"$f":"IF(A103 = \"\", \"\", VLOOKUP(A103,Master!$B$91:$AC$114,COLUMN(Master!$Q$1)-1,FALSE))","v":""},{"$f":"IF(A103 = \"\", \"\", VLOOKUP(A103,Master!$B$91:$AC$114,COLUMN(Master!$Y$1)-1,FALSE))","v":""},null,{"$f":"IF(A103 = \"\", \"\", VLOOKUP(A103,Master!$B$91:$AC$114,COLUMN(Master!$AA$1)-1,FALSE))","v":""},{"$f":"IF(A103 = \"\", \"\", VLOOKUP(A103,Master!$B$91:$AC$114,COLUMN(Master!$AB$1)-1,FALSE))","v":""}]
[null,{"$f":"IF(A104 = \"\", \"\", VLOOKUP(A104,Master!$B$91:$AC$114,COLUMN(Master!$Q$1)-1,FALSE))","v":""},{"$f":"IF(A104 = \"\", \"\", VLOOKUP(A104,Master!$B$91:$AC$114,COLUMN(Master!$Y$1)-1,FALSE))","v":""},null,{"$f":"IF(A104 = \"\", \"\", VLOOKUP(A104,Master!$B$91:$AC$114,COLUMN(Master!$AA$1)-1,FALSE))","v":""},{"$f":"IF(A104 = \"\", \"\", VLOOKUP(A104,Master!$B$91:$AC$114,COLUMN(Master!$AB$1)-1,FALSE))","v":""}]
[null,{"$f":"IF(A105 = \"\", \"\", VLOOKUP(A105,Master!$B$91:$AC$114,COLUMN(Master!$Q$1)-1,FALSE))","v":""},{"$f":"IF(A105 = \"\", \"\", VLOOKUP(A105,Master!$B$91:$AC$114,COLUMN(Master!$Y$1)-1,FALSE))","v":""},null,{"$f":"IF(A105 = \"\", \"\", VLOOKUP(A105,Master!$B$91:$AC$114,COLUMN(Master!$AA$1)-1,FALSE))","v":""},{"$f":"IF(A105 = \"\", \"\", VLOOKUP(A105,Master!$B$91:$AC$114,COLUMN(Master!$AB$1)-1,FALSE))","v":""}]
[null,{"$f":"IF(A106 = \"\", \"\", VLOOKUP(A106,Master!$B$91:$AC$114,COLUMN(Master!$Q$1)-1,FALSE))","v":""},{"$f":"IF(A106 = \"\", \"\", VLOOKUP(A106,Master!$B$91:$AC$114,COLUMN(Master!$Y$1)-1,FALSE))","v":""},null,{"$f":"IF(A106 = \"\", \"\", VLOOKUP(A106,Master!$B$91:$AC$114,COLUMN(Master!$AA$1)-1,FALSE))","v":""},{"$f":"IF(A106 = \"\", \"\", VLOOKUP(A106,Master!$B$91:$AC$114,COLUMN(Master!$AB$1)-1,FALSE))","v":""}]
[null,{"$f":"IF(A107 = \"\", \"\", VLOOKUP(A107,Master!$B$91:$AC$114,COLUMN(Master!$Q$1)-1,FALSE))","v":""},{"$f":"IF(A107 = \"\", \"\", VLOOKUP(A107,Master!$B$91:$AC$114,COLUMN(Master!$Y$1)-1,FALSE))","v":""},null,{"$f":"IF(A107 = \"\", \"\", VLOOKUP(A107,Master!$B$91:$AC$114,COLUMN(Master!$AA$1)-1,FALSE))","v":""},{"$f":"IF(A107 = \"\", \"\", VLOOKUP(A107,Master!$B$91:$AC$114,COLUMN(Master!$AB$1)-1,FALSE))","v":""}]
[null,{"$f":"IF(A108 = \"\", \"\", VLOOKUP(A108,Master!$B$91:$AC$114,COLUMN(Master!$Q$1)-1,FALSE))","v":""},null,null,{"$f":"IF(A108 = \"\", \"\", VLOOKUP(A108,Master!$B$91:$AC$114,COLUMN(Master!$AA$1)-1,FALSE))","v":""},{"$f":"IF(A108 = \"\", \"\", VLOOKUP(A108,Master!$B$91:$AC$114,COLUMN(Master!$AB$1)-1,FALSE))","v":""}]
[null,{"$f":"IF(A109 = \"\", \"\", VLOOKUP(A109,Master!$B$91:$AC$114,COLUMN(Master!$Q$1)-1,FALSE))","v":""},null,null,{"$f":"IF(A109 = \"\", \"\", VLOOKUP(A109,Master!$B$91:$AC$114,COLUMN(Master!$AA$1)-1,FALSE))","v":""},{"$f":"IF(A109 = \"\", \"\", VLOOKUP(A109,Master!$B$91:$AC$114,COLUMN(Master!$AB$1)-1,FALSE))","v":""}]
[null,{"$f":"IF(A110 = \"\", \"\", VLOOKUP(A110,Master!$B$91:$AC$114,COLUMN(Master!$Q$1)-1,FALSE))","v":""},null,null,{"$f":"IF(A110 = \"\", \"\", VLOOKUP(A110,Master!$B$91:$AC$114,COLUMN(Master!$AA$1)-1,FALSE))","v":""},{"$f":"IF(A110 = \"\", \"\", VLOOKUP(A110,Master!$B$91:$AC$114,COLUMN(Master!$AB$1)-1,FALSE))","v":""}]
[null,{"$f":"IF(A111 = \"\", \"\", VLOOKUP(A111,Master!$B$91:$AC$114,COLUMN(Master!$Q$1)-1,FALSE))","v":""},null,null,{"$f":"IF(A111 = \"\", \"\", VLOOKUP(A111,Master!$B$91:$AC$114,COLUMN(Master!$AA$1)-1,FALSE))","v":""},{"$f":"IF(A111 = \"\", \"\", VLOOKUP(A111,Master!$B$91:$AC$114,COLUMN(Master!$AB$1)-1,FALSE))","v":""}]
[null,{"$f":"IF(A112 = \"\", \"\", VLOOKUP(A112,Master!$B$91:$AC$114,COLUMN(Master!$Q$1)-1,FALSE))","v":""},null,null,{"$f":"IF(A112 = \"\", \"\", VLOOKUP(A112,Master!$B$91:$AC$114,COLUMN(Master!$AA$1)-1,FALSE))","v":""},{"$f":"IF(A112 = \"\", \"\", VLOOKUP(A112,Master!$B$91:$AC$114,COLUMN(Master!$AB$1)-1,FALSE))","v":""}]
[null,{"$f":"IF(A113 = \"\", \"\", VLOOKUP(A113,Master!$B$91:$AC$114,COLUMN(Master!$Q$1)-1,FALSE))","v":""},null,null,{"$f":"IF(A113 = \"\", \"\", VLOOKUP(A113,Master!$B$91:$AC$114,COLUMN(Master!$AA$1)-1,FALSE))","v":""},{"$f":"IF(A113 = \"\", \"\", VLOOKUP(A113,Master!$B$91:$AC$114,COLUMN(Master!$AB$1)-1,FALSE))","v":""}]
[null,{"$f":"IF(A114 = \"\", \"\", VLOOKUP(A114,Master!$B$91:$AC$114,COLUMN(Master!$Q$1)-1,FALSE))","v":""},null,null,{"$f":"IF(A114 = \"\", \"\", VLOOKUP(A114,Master!$B$91:$AC$114,COLUMN(Master!$AA$1)-1,FALSE))","v":""},{"$f":"IF(A114 = \"\", \"\", VLOOKUP(A114,Master!$B$91:$AC$114,COLUMN(Master!$AB$1)-1,FALSE))","v":""}]
[null,{"$f":"IF(A115 = \"\", \"\", VLOOKUP(A115,Master!$B$91:$AC$114,COLUMN(Master!$Q$1)-1,FALSE))","v":""},null,null,{"$f":"IF(A115 = \"\", \"\", VLOOKUP(A115,Master!$B$91:$AC$114,COLUMN(Master!$AA$1)-1,FALSE))","v":""},{"$f":"IF(A115 = \"\", \"\", VLOOKUP(A115,Master!$B$91:$AC$114,COLUMN(Master!$AB$1)-1,FALSE))","v":""}]
[null,{"$f":"IF(A116 = \"\", \"\", VLOOKUP(A116,Master!$B$91:$AC$114,COLUMN(Master!$Q$1)-1,FALSE))","v":""},null,null,{"$f":"IF(A116 = \"\", \"\", VLOOKUP(A116,Master!$B$91:$AC$114,COLUMN(Master!$AA$1)-1,FALSE))","v":""},{"$f":"IF(A116 = \"\", \"\", VLOOKUP(A116,Master!$B$91:$AC$114,COLUMN(Master!$AB$1)-1,FALSE))","v":""}]
[null,{"$f":"IF(A117 = \"\", \"\", VLOOKUP(A117,Master!$B$91:$AC$114,COLUMN(Master!$Q$1)-1,FALSE))","v":""},null,null,{"$f":"IF(A117 = \"\", \"\", VLOOKUP(A117,Master!$B$91:$AC$114,COLUMN(Master!$AA$1)-1,FALSE))","v":""},{"$f":"IF(A117 = \"\", \"\", VLOOKUP(A117,Master!$B$91:$AC$114,COLUMN(Master!$AB$1)-1,FALSE))","v":""}]
[null,{"$f":"IF(A118 = \"\", \"\", VLOOKUP(A118,Master!$B$91:$AC$114,COLUMN(Master!$Q$1)-1,FALSE))","v":""},null,null,{"$f":"IF(A118 = \"\", \"\", VLOOKUP(A118,Master!$B$91:$AC$114,COLUMN(Master!$AA$1)-1,FALSE))","v":""},{"$f":"IF(A118 = \"\", \"\", VLOOKUP(A118,Master!$B$91:$AC$114,COLUMN(Master!$AB$1)-1,FALSE))","v":""}]
[null,{"$f":"IF(A119 = \"\", \"\", VLOOKUP(A119,Master!$B$91:$AC$114,COLUMN(Master!$Q$1)-1,FALSE))","v":""},null,null,{"$f":"IF(A119 = \"\", \"\", VLOOKUP(A119,Master!$B$91:$AC$114,COLUMN(Master!$AA$1)-1,FALSE))","v":""},{"$f":"IF(A119 = \"\", \"\", VLOOKUP(A119,Master!$B$91:$AC$114,COLUMN(Master!$AB$1)-1,FALSE))","v":""}]
[null,{"$f":"IF(A120 = \"\", \"\", VLOOKUP(A120,Master!$B$91:$AC$114,COLUMN(Master!$Q$1)-1,FALSE))","v":""},null,null,{"$f":"IF(A120 = \"\", \"\", VLOOKUP(A120,Master!$B$91:$AC$114,COLUMN(Master!$AA$1)-1,FALSE))","v":""},{"$f":"IF(A120 = \"\", \"\", VLOOKUP(A120,Master!$B$91:$AC$114,COLUMN(Master!$AB$1)-1,FALSE))","v":""}]
[null,{"$f":"IF(A121 = \"\", \"\", VLOOKUP(A121,Master!$B$91:$AC$114,COLUMN(Master!$Q$1)-1,FALSE))","v":""},null,null,{"$f":"IF(A121 = \"\", \"\", VLOOKUP(A121,Master!$B$91:$AC$114,COLUMN(Master!$AA$1)-1,FALSE))","v":""},{"$f":"IF(A121 = \"\", \"\", VLOOKUP(A121,Master!$B$91:$AC$114,COLUMN(Master!$AB$1)-1,FALSE))","v":""}]
[null,{"$f":"IF(A122 = \"\", \"\", VLOOKUP(A122,Master!$B$91:$AC$114,COLUMN(Master!$Q$1)-1,FALSE))","v":""},null,null,{"$f":"IF(A122 = \"\", \"\", VLOOKUP(A122,Master!$B$91:$AC$114,COLUMN(Master!$AA$1)-1,FALSE))","v":""},{"$f":"IF(A122 = \"\", \"\", VLOOKUP(A122,Master!$B$91:$AC$114,COLUMN(Master!$AB$1)-1,FALSE))","v":""}]
[null,{"$f":"IF(A123 = \"\", \"\", VLOOKUP(A123,Master!$B$91:$AC$114,COLUMN(Master!$Q$1)-1,FALSE))","v":""},null,null,{"$f":"IF(A123 = \"\", \"\", VLOOKUP(A123,Master!$B$91:$AC$114,COLUMN(Master!$AA$1)-1,FALSE))","v":""},{"$f":"IF(A123 = \"\", \"\", VLOOKUP(A123,Master!$B$91:$AC$114,COLUMN(Master!$AB$1)-1,FALSE))","v":""}]

{"sheet":"Use & Disposal","index":7,"n_rows":68,"n_cols":4,"rows_kept":68,"cut":false,"hidden":false,"merged":[]}
["USE and/or DISPOSAL"]
[]
[]
[]
[]
[]
[]
[]
[]
[]
[]
[]
[]
[]
[]
[]
[]
[]
[]
["Phase","Use and/or Disposal"]
["Potential application ","(All)"]
["End products ","Reuse or disposal","Outputs for reuse",{"$f":"Master!AF1","v":"Potential application "}]
["Biogas",{"$f":"IF(A23 = \"\", \"\", VLOOKUP(A23,Master!$B$116:$AF$126,COLUMN(Master!$AD$1)-1,FALSE))","v":"Reuse"},{"$f":"IF(A23 = \"\", \"\", VLOOKUP(A23,Master!$B$116:$AF$126,COLUMN(Master!$AE$1)-1,FALSE))","v":"Biogas"},{"$f":"IF(A23 = \"\", \"\", VLOOKUP(A23,Master!$B$116:$AF$126,COLUMN(Master!$AF$1)-1,FALSE))","v":"Cooking, lighting, charging a generator. "}]
["Biomass",{"$f":"IF(A24 = \"\", \"\", VLOOKUP(A24,Master!$B$116:$AF$126,COLUMN(Master!$AD$1)-1,FALSE))","v":"Reuse"},{"$f":"IF(A24 = \"\", \"\", VLOOKUP(A24,Master!$B$116:$AF$126,COLUMN(Master!$AE$1)-1,FALSE))","v":"Biomass"},{"$f":"IF(A24 = \"\", \"\", VLOOKUP(A24,Master!$B$116:$AF$126,COLUMN(Master!$AF$1)-1,FALSE))","v":"Includes fish, insects, vegetables, fruits, forage or other beneficial crops."}]
["Briquettes",{"$f":"IF(A25 = \"\", \"\", VLOOKUP(A25,Master!$B$116:$AF$126,COLUMN(Master!$AD$1)-1,FALSE))","v":"Reuse"},{"$f":"IF(A25 = \"\", \"\", VLOOKUP(A25,Master!$B$116:$AF$126,COLUMN(Master!$AE$1)-1,FALSE))","v":"Briquettes"},{"$f":"IF(A25 = \"\", \"\", VLOOKUP(A25,Master!$B$116:$AF$126,COLUMN(Master!$AF$1)-1,FALSE))","v":"Cooking, heat."}]
["Compost",{"$f":"IF(A26 = \"\", \"\", VLOOKUP(A26,Master!$B$116:$AF$126,COLUMN(Master!$AD$1)-1,FALSE))","v":"Reuse"},{"$f":"IF(A26 = \"\", \"\", VLOOKUP(A26,Master!$B$116:$AF$126,COLUMN(Master!$AE$1)-1,FALSE))","v":"Compost"},{"$f":"IF(A26 = \"\", \"\", VLOOKUP(A26,Master!$B$116:$AF$126,COLUMN(Master!$AF$1)-1,FALSE))","v":"Fertilizer for soil fertility, moisture retention, and increase in agricultural/horticultural productivity. "}]
["Disinfected dried solids ",{"$f":"IF(A27 = \"\", \"\", VLOOKUP(A27,Master!$B$116:$AF$126,COLUMN(Master!$AD$1)-1,FALSE))","v":"Disposal"},{"$f":"IF(A27 = \"\", \"\", VLOOKUP(A27,Master!$B$116:$AF$126,COLUMN(Master!$AE$1)-1,FALSE))","v":"None"},{"$f":"IF(A27 = \"\", \"\", VLOOKUP(A27,Master!$B$116:$AF$126,COLUMN(Master!$AF$1)-1,FALSE))","v":"Fill and cover, land application, surface disposal."}]
["Effluent (treated, disinfected)",{"$f":"IF(A28 = \"\", \"\", VLOOKUP(A28,Master!$B$116:$AF$126,COLUMN(Master!$AD$1)-1,FALSE))","v":"Disposal"},{"$f":"IF(A28 = \"\", \"\", VLOOKUP(A28,Master!$B$116:$AF$126,COLUMN(Master!$AE$1)-1,FALSE))","v":"None"},{"$f":"IF(A28 = \"\", \"\", VLOOKUP(A28,Master!$B$116:$AF$126,COLUMN(Master!$AF$1)-1,FALSE))","v":"Irrigation, soak pit, leach field."}]
["Sludge",{"$f":"IF(A29 = \"\", \"\", VLOOKUP(A29,Master!$B$116:$AF$126,COLUMN(Master!$AD$1)-1,FALSE))","v":"Disposal"},{"$f":"IF(A29 = \"\", \"\", VLOOKUP(A29,Master!$B$116:$AF$126,COLUMN(Master!$AE$1)-1,FALSE))","v":"None"},{"$f":"IF(A29 = \"\", \"\", VLOOKUP(A29,Master!$B$116:$AF$126,COLUMN(Master!$AF$1)-1,FALSE))","v":"Fill and cover, land application, surface disposal (depends on level of treatment)."}]
[null,{"$f":"IF(A30 = \"\", \"\", VLOOKUP(A30,Master!$B$116:$AF$126,COLUMN(Master!$AD$1)-1,FALSE))","v":""},{"$f":"IF(A30 = \"\", \"\", VLOOKUP(A30,Master!$B$116:$AF$126,COLUMN(Master!$AE$1)-1,FALSE))","v":""},{"$f":"IF(A30 = \"\", \"\", VLOOKUP(A30,Master!$B$116:$AF$126,COLUMN(Master!$AF$1)-1,FALSE))","v":""}]
[null,{"$f":"IF(A31 = \"\", \"\", VLOOKUP(A31,Master!$B$116:$AF$126,COLUMN(Master!$AD$1)-1,FALSE))","v":""},{"$f":"IF(A31 = \"\", \"\", VLOOKUP(A31,Master!$B$116:$AF$126,COLUMN(Master!$AE$1)-1,FALSE))","v":""},{"$f":"IF(A31 = \"\", \"\", VLOOKUP(A31,Master!$B$116:$AF$126,COLUMN(Master!$AF$1)-1,FALSE))","v":""}]
[null,{"$f":"IF(A32 = \"\", \"\", VLOOKUP(A32,Master!$B$116:$AF$126,COLUMN(Master!$AD$1)-1,FALSE))","v":""},{"$f":"IF(A32 = \"\", \"\", VLOOKUP(A32,Master!$B$116:$AF$126,COLUMN(Master!$AE$1)-1,FALSE))","v":""},{"$f":"IF(A32 = \"\", \"\", VLOOKUP(A32,Master!$B$116:$AF$126,COLUMN(Master!$AF$1)-1,FALSE))","v":""}]
[null,{"$f":"IF(A33 = \"\", \"\", VLOOKUP(A33,Master!$B$116:$AF$126,COLUMN(Master!$AD$1)-1,FALSE))","v":""},{"$f":"IF(A33 = \"\", \"\", VLOOKUP(A33,Master!$B$116:$AF$126,COLUMN(Master!$AE$1)-1,FALSE))","v":""},{"$f":"IF(A33 = \"\", \"\", VLOOKUP(A33,Master!$B$116:$AF$126,COLUMN(Master!$AF$1)-1,FALSE))","v":""}]
[null,{"$f":"IF(A34 = \"\", \"\", VLOOKUP(A34,Master!$B$116:$AF$126,COLUMN(Master!$AD$1)-1,FALSE))","v":""},{"$f":"IF(A34 = \"\", \"\", VLOOKUP(A34,Master!$B$116:$AF$126,COLUMN(Master!$AE$1)-1,FALSE))","v":""},{"$f":"IF(A34 = \"\", \"\", VLOOKUP(A34,Master!$B$116:$AF$126,COLUMN(Master!$AF$1)-1,FALSE))","v":""}]
[null,{"$f":"IF(A35 = \"\", \"\", VLOOKUP(A35,Master!$B$116:$AF$126,COLUMN(Master!$AD$1)-1,FALSE))","v":""},{"$f":"IF(A35 = \"\", \"\", VLOOKUP(A35,Master!$B$116:$AF$126,COLUMN(Master!$AE$1)-1,FALSE))","v":""},{"$f":"IF(A35 = \"\", \"\", VLOOKUP(A35,Master!$B$116:$AF$126,COLUMN(Master!$AF$1)-1,FALSE))","v":""}]
[null,{"$f":"IF(A36 = \"\", \"\", VLOOKUP(A36,Master!$B$116:$AF$126,COLUMN(Master!$AD$1)-1,FALSE))","v":""},{"$f":"IF(A36 = \"\", \"\", VLOOKUP(A36,Master!$B$116:$AF$126,COLUMN(Master!$AE$1)-1,FALSE))","v":""},{"$f":"IF(A36 = \"\", \"\", VLOOKUP(A36,Master!$B$116:$AF$126,COLUMN(Master!$AF$1)-1,FALSE))","v":""}]
[null,{"$f":"IF(A37 = \"\", \"\", VLOOKUP(A37,Master!$B$116:$AF$126,COLUMN(Master!$AD$1)-1,FALSE))","v":""},{"$f":"IF(A37 = \"\", \"\", VLOOKUP(A37,Master!$B$116:$AF$126,COLUMN(Master!$AE$1)-1,FALSE))","v":""},{"$f":"IF(A37 = \"\", \"\", VLOOKUP(A37,Master!$B$116:$AF$126,COLUMN(Master!$AF$1)-1,FALSE))","v":""}]
[null,{"$f":"IF(A38 = \"\", \"\", VLOOKUP(A38,Master!$B$116:$AF$126,COLUMN(Master!$AD$1)-1,FALSE))","v":""},{"$f":"IF(A38 = \"\", \"\", VLOOKUP(A38,Master!$B$116:$AF$126,COLUMN(Master!$AE$1)-1,FALSE))","v":""},{"$f":"IF(A38 = \"\", \"\", VLOOKUP(A38,Master!$B$116:$AF$126,COLUMN(Master!$AF$1)-1,FALSE))","v":""}]
[null,{"$f":"IF(A39 = \"\", \"\", VLOOKUP(A39,Master!$B$116:$AF$126,COLUMN(Master!$AD$1)-1,FALSE))","v":""},{"$f":"IF(A39 = \"\", \"\", VLOOKUP(A39,Master!$B$116:$AF$126,COLUMN(Master!$AE$1)-1,FALSE))","v":""},{"$f":"IF(A39 = \"\", \"\", VLOOKUP(A39,Master!$B$116:$AF$126,COLUMN(Master!$AF$1)-1,FALSE))","v":""}]
[null,{"$f":"IF(A40 = \"\", \"\", VLOOKUP(A40,Master!$B$116:$AF$126,COLUMN(Master!$AD$1)-1,FALSE))","v":""},{"$f":"IF(A40 = \"\", \"\", VLOOKUP(A40,Master!$B$116:$AF$126,COLUMN(Master!$AE$1)-1,FALSE))","v":""},{"$f":"IF(A40 = \"\", \"\", VLOOKUP(A40,Master!$B$116:$AF$126,COLUMN(Master!$AF$1)-1,FALSE))","v":""}]
[null,{"$f":"IF(A41 = \"\", \"\", VLOOKUP(A41,Master!$B$116:$AF$126,COLUMN(Master!$AD$1)-1,FALSE))","v":""},{"$f":"IF(A41 = \"\", \"\", VLOOKUP(A41,Master!$B$116:$AF$126,COLUMN(Master!$AE$1)-1,FALSE))","v":""},{"$f":"IF(A41 = \"\", \"\", VLOOKUP(A41,Master!$B$116:$AF$126,COLUMN(Master!$AF$1)-1,FALSE))","v":""}]
[null,{"$f":"IF(A42 = \"\", \"\", VLOOKUP(A42,Master!$B$116:$AF$126,COLUMN(Master!$AD$1)-1,FALSE))","v":""},{"$f":"IF(A42 = \"\", \"\", VLOOKUP(A42,Master!$B$116:$AF$126,COLUMN(Master!$AE$1)-1,FALSE))","v":""},{"$f":"IF(A42 = \"\", \"\", VLOOKUP(A42,Master!$B$116:$AF$126,COLUMN(Master!$AF$1)-1,FALSE))","v":""}]
[null,{"$f":"IF(A43 = \"\", \"\", VLOOKUP(A43,Master!$B$116:$AF$126,COLUMN(Master!$AD$1)-1,FALSE))","v":""},{"$f":"IF(A43 = \"\", \"\", VLOOKUP(A43,Master!$B$116:$AF$126,COLUMN(Master!$AE$1)-1,FALSE))","v":""},{"$f":"IF(A43 = \"\", \"\", VLOOKUP(A43,Master!$B$116:$AF$126,COLUMN(Master!$AF$1)-1,FALSE))","v":""}]
[null,{"$f":"IF(A44 = \"\", \"\", VLOOKUP(A44,Master!$B$116:$AF$126,COLUMN(Master!$AD$1)-1,FALSE))","v":""},{"$f":"IF(A44 = \"\", \"\", VLOOKUP(A44,Master!$B$116:$AF$126,COLUMN(Master!$AE$1)-1,FALSE))","v":""},{"$f":"IF(A44 = \"\", \"\", VLOOKUP(A44,Master!$B$116:$AF$126,COLUMN(Master!$AF$1)-1,FALSE))","v":""}]
[null,{"$f":"IF(A45 = \"\", \"\", VLOOKUP(A45,Master!$B$116:$AF$126,COLUMN(Master!$AD$1)-1,FALSE))","v":""},{"$f":"IF(A45 = \"\", \"\", VLOOKUP(A45,Master!$B$116:$AF$126,COLUMN(Master!$AE$1)-1,FALSE))","v":""},{"$f":"IF(A45 = \"\", \"\", VLOOKUP(A45,Master!$B$116:$AF$126,COLUMN(Master!$AF$1)-1,FALSE))","v":""}]
[null,{"$f":"IF(A46 = \"\", \"\", VLOOKUP(A46,Master!$B$116:$AF$126,COLUMN(Master!$AD$1)-1,FALSE))","v":""},{"$f":"IF(A46 = \"\", \"\", VLOOKUP(A46,Master!$B$116:$AF$126,COLUMN(Master!$AE$1)-1,FALSE))","v":""},{"$f":"IF(A46 = \"\", \"\", VLOOKUP(A46,Master!$B$116:$AF$126,COLUMN(Master!$AF$1)-1,FALSE))","v":""}]
[null,{"$f":"IF(A47 = \"\", \"\", VLOOKUP(A47,Master!$B$116:$AF$126,COLUMN(Master!$AD$1)-1,FALSE))","v":""},{"$f":"IF(A47 = \"\", \"\", VLOOKUP(A47,Master!$B$116:$AF$126,COLUMN(Master!$AE$1)-1,FALSE))","v":""},{"$f":"IF(A47 = \"\", \"\", VLOOKUP(A47,Master!$B$116:$AF$126,COLUMN(Master!$AF$1)-1,FALSE))","v":""}]
[null,{"$f":"IF(A48 = \"\", \"\", VLOOKUP(A48,Master!$B$116:$AF$126,COLUMN(Master!$AD$1)-1,FALSE))","v":""},{"$f":"IF(A48 = \"\", \"\", VLOOKUP(A48,Master!$B$116:$AF$126,COLUMN(Master!$AE$1)-1,FALSE))","v":""},{"$f":"IF(A48 = \"\", \"\", VLOOKUP(A48,Master!$B$116:$AF$126,COLUMN(Master!$AF$1)-1,FALSE))","v":""}]
[null,{"$f":"IF(A49 = \"\", \"\", VLOOKUP(A49,Master!$B$116:$AF$126,COLUMN(Master!$AD$1)-1,FALSE))","v":""},{"$f":"IF(A49 = \"\", \"\", VLOOKUP(A49,Master!$B$116:$AF$126,COLUMN(Master!$AE$1)-1,FALSE))","v":""},{"$f":"IF(A49 = \"\", \"\", VLOOKUP(A49,Master!$B$116:$AF$126,COLUMN(Master!$AF$1)-1,FALSE))","v":""}]
[null,{"$f":"IF(A50 = \"\", \"\", VLOOKUP(A50,Master!$B$116:$AF$126,COLUMN(Master!$AD$1)-1,FALSE))","v":""},{"$f":"IF(A50 = \"\", \"\", VLOOKUP(A50,Master!$B$116:$AF$126,COLUMN(Master!$AE$1)-1,FALSE))","v":""},{"$f":"IF(A50 = \"\", \"\", VLOOKUP(A50,Master!$B$116:$AF$126,COLUMN(Master!$AF$1)-1,FALSE))","v":""}]
[null,{"$f":"IF(A51 = \"\", \"\", VLOOKUP(A51,Master!$B$116:$AF$126,COLUMN(Master!$AD$1)-1,FALSE))","v":""},{"$f":"IF(A51 = \"\", \"\", VLOOKUP(A51,Master!$B$116:$AF$126,COLUMN(Master!$AE$1)-1,FALSE))","v":""},{"$f":"IF(A51 = \"\", \"\", VLOOKUP(A51,Master!$B$116:$AF$126,COLUMN(Master!$AF$1)-1,FALSE))","v":""}]
[null,{"$f":"IF(A52 = \"\", \"\", VLOOKUP(A52,Master!$B$116:$AF$126,COLUMN(Master!$AD$1)-1,FALSE))","v":""},{"$f":"IF(A52 = \"\", \"\", VLOOKUP(A52,Master!$B$116:$AF$126,COLUMN(Master!$AE$1)-1,FALSE))","v":""},{"$f":"IF(A52 = \"\", \"\", VLOOKUP(A52,Master!$B$116:$AF$126,COLUMN(Master!$AF$1)-1,FALSE))","v":""}]
[null,{"$f":"IF(A53 = \"\", \"\", VLOOKUP(A53,Master!$B$116:$AF$126,COLUMN(Master!$AD$1)-1,FALSE))","v":""},{"$f":"IF(A53 = \"\", \"\", VLOOKUP(A53,Master!$B$116:$AF$126,COLUMN(Master!$AE$1)-1,FALSE))","v":""},{"$f":"IF(A53 = \"\", \"\", VLOOKUP(A53,Master!$B$116:$AF$126,COLUMN(Master!$AF$1)-1,FALSE))","v":""}]
[null,{"$f":"IF(A54 = \"\", \"\", VLOOKUP(A54,Master!$B$116:$AF$126,COLUMN(Master!$AD$1)-1,FALSE))","v":""},{"$f":"IF(A54 = \"\", \"\", VLOOKUP(A54,Master!$B$116:$AF$126,COLUMN(Master!$AE$1)-1,FALSE))","v":""},{"$f":"IF(A54 = \"\", \"\", VLOOKUP(A54,Master!$B$116:$AF$126,COLUMN(Master!$AF$1)-1,FALSE))","v":""}]
[null,{"$f":"IF(A55 = \"\", \"\", VLOOKUP(A55,Master!$B$116:$AF$126,COLUMN(Master!$AD$1)-1,FALSE))","v":""},{"$f":"IF(A55 = \"\", \"\", VLOOKUP(A55,Master!$B$116:$AF$126,COLUMN(Master!$AE$1)-1,FALSE))","v":""},{"$f":"IF(A55 = \"\", \"\", VLOOKUP(A55,Master!$B$116:$AF$126,COLUMN(Master!$AF$1)-1,FALSE))","v":""}]
[null,{"$f":"IF(A56 = \"\", \"\", VLOOKUP(A56,Master!$B$116:$AF$126,COLUMN(Master!$AD$1)-1,FALSE))","v":""},{"$f":"IF(A56 = \"\", \"\", VLOOKUP(A56,Master!$B$116:$AF$126,COLUMN(Master!$AE$1)-1,FALSE))","v":""},{"$f":"IF(A56 = \"\", \"\", VLOOKUP(A56,Master!$B$116:$AF$126,COLUMN(Master!$AF$1)-1,FALSE))","v":""}]
[null,{"$f":"IF(A57 = \"\", \"\", VLOOKUP(A57,Master!$B$116:$AF$121,COLUMN(Master!$AD$1)-1,FALSE))","v":""},{"$f":"IF(A57 = \"\", \"\", VLOOKUP(A57,Master!$B$116:$AF$121,COLUMN(Master!$AE$1)-1,FALSE))","v":""},{"$f":"IF(A57 = \"\", \"\", VLOOKUP(A57,Master!$B$116:$AF$121,COLUMN(Master!$AF$1)-1,FALSE))","v":""}]
[null,{"$f":"IF(A58 = \"\", \"\", VLOOKUP(A58,Master!$B$116:$AF$121,COLUMN(Master!$AD$1)-1,FALSE))","v":""},{"$f":"IF(A58 = \"\", \"\", VLOOKUP(A58,Master!$B$116:$AF$121,COLUMN(Master!$AE$1)-1,FALSE))","v":""},{"$f":"IF(A58 = \"\", \"\", VLOOKUP(A58,Master!$B$116:$AF$121,COLUMN(Master!$AF$1)-1,FALSE))","v":""}]
[null,{"$f":"IF(A59 = \"\", \"\", VLOOKUP(A59,Master!$B$116:$AF$121,COLUMN(Master!$AD$1)-1,FALSE))","v":""},{"$f":"IF(A59 = \"\", \"\", VLOOKUP(A59,Master!$B$116:$AF$121,COLUMN(Master!$AE$1)-1,FALSE))","v":""},{"$f":"IF(A59 = \"\", \"\", VLOOKUP(A59,Master!$B$116:$AF$121,COLUMN(Master!$AF$1)-1,FALSE))","v":""}]
[null,{"$f":"IF(A60 = \"\", \"\", VLOOKUP(A60,Master!$B$116:$AF$121,COLUMN(Master!$AD$1)-1,FALSE))","v":""},{"$f":"IF(A60 = \"\", \"\", VLOOKUP(A60,Master!$B$116:$AF$121,COLUMN(Master!$AE$1)-1,FALSE))","v":""},{"$f":"IF(A60 = \"\", \"\", VLOOKUP(A60,Master!$B$116:$AF$121,COLUMN(Master!$AF$1)-1,FALSE))","v":""}]
[null,{"$f":"IF(A61 = \"\", \"\", VLOOKUP(A61,Master!$B$116:$AF$121,COLUMN(Master!$AD$1)-1,FALSE))","v":""},{"$f":"IF(A61 = \"\", \"\", VLOOKUP(A61,Master!$B$116:$AF$121,COLUMN(Master!$AE$1)-1,FALSE))","v":""},{"$f":"IF(A61 = \"\", \"\", VLOOKUP(A61,Master!$B$116:$AF$121,COLUMN(Master!$AF$1)-1,FALSE))","v":""}]
[null,{"$f":"IF(A62 = \"\", \"\", VLOOKUP(A62,Master!$B$116:$AF$121,COLUMN(Master!$AD$1)-1,FALSE))","v":""},{"$f":"IF(A62 = \"\", \"\", VLOOKUP(A62,Master!$B$116:$AF$121,COLUMN(Master!$AE$1)-1,FALSE))","v":""},{"$f":"IF(A62 = \"\", \"\", VLOOKUP(A62,Master!$B$116:$AF$121,COLUMN(Master!$AF$1)-1,FALSE))","v":""}]
[null,{"$f":"IF(A63 = \"\", \"\", VLOOKUP(A63,Master!$B$116:$AF$121,COLUMN(Master!$AD$1)-1,FALSE))","v":""},{"$f":"IF(A63 = \"\", \"\", VLOOKUP(A63,Master!$B$116:$AF$121,COLUMN(Master!$AE$1)-1,FALSE))","v":""},{"$f":"IF(A63 = \"\", \"\", VLOOKUP(A63,Master!$B$116:$AF$121,COLUMN(Master!$AF$1)-1,FALSE))","v":""}]
[null,{"$f":"IF(A64 = \"\", \"\", VLOOKUP(A64,Master!$B$116:$AF$121,COLUMN(Master!$AD$1)-1,FALSE))","v":""},{"$f":"IF(A64 = \"\", \"\", VLOOKUP(A64,Master!$B$116:$AF$121,COLUMN(Master!$AE$1)-1,FALSE))","v":""},{"$f":"IF(A64 = \"\", \"\", VLOOKUP(A64,Master!$B$116:$AF$121,COLUMN(Master!$AF$1)-1,FALSE))","v":""}]
[null,{"$f":"IF(A65 = \"\", \"\", VLOOKUP(A65,Master!$B$116:$AF$121,COLUMN(Master!$AD$1)-1,FALSE))","v":""},{"$f":"IF(A65 = \"\", \"\", VLOOKUP(A65,Master!$B$116:$AF$121,COLUMN(Master!$AE$1)-1,FALSE))","v":""},{"$f":"IF(A65 = \"\", \"\", VLOOKUP(A65,Master!$B$116:$AF$121,COLUMN(Master!$AF$1)-1,FALSE))","v":""}]
[null,{"$f":"IF(A66 = \"\", \"\", VLOOKUP(A66,Master!$B$116:$AF$121,COLUMN(Master!$AD$1)-1,FALSE))","v":""},{"$f":"IF(A66 = \"\", \"\", VLOOKUP(A66,Master!$B$116:$AF$121,COLUMN(Master!$AE$1)-1,FALSE))","v":""},{"$f":"IF(A66 = \"\", \"\", VLOOKUP(A66,Master!$B$116:$AF$121,COLUMN(Master!$AF$1)-1,FALSE))","v":""}]
[null,{"$f":"IF(A67 = \"\", \"\", VLOOKUP(A67,Master!$B$116:$AF$121,COLUMN(Master!$AD$1)-1,FALSE))","v":""},{"$f":"IF(A67 = \"\", \"\", VLOOKUP(A67,Master!$B$116:$AF$121,COLUMN(Master!$AE$1)-1,FALSE))","v":""},{"$f":"IF(A67 = \"\", \"\", VLOOKUP(A67,Master!$B$116:$AF$121,COLUMN(Master!$AF$1)-1,FALSE))","v":""}]
[null,{"$f":"IF(A68 = \"\", \"\", VLOOKUP(A68,Master!$B$116:$AF$121,COLUMN(Master!$AD$1)-1,FALSE))","v":""},{"$f":"IF(A68 = \"\", \"\", VLOOKUP(A68,Master!$B$116:$AF$121,COLUMN(Master!$AE$1)-1,FALSE))","v":""},{"$f":"IF(A68 = \"\", \"\", VLOOKUP(A68,Master!$B$116:$AF$121,COLUMN(Master!$AF$1)-1,FALSE))","v":""}]

{"sheet":"Summary","index":8,"n_rows":140,"n_cols":13,"rows_kept":140,"cut":false,"hidden":false,"merged":[]}
["Summary"]
["USER INTERFACE      Please review and confirm that 'Method of Use' filter matches with technology options under Storage & Containment. "]
["Technology","Type of system","Method of use","Urine diverting","Primary materials","Availability ","Proceed to "]
["Container Based Solutions","Either","Container","Either","Various","For purchase","Storage & containment"]
["Ecological Urinal ","Dry","Squat","Yes","Plastic","For purchase","Storage & containment"]
["Ecosan Pit Toilets - VIP 450, VIP 200","Dry","Sit","No","Plastic","For purchase","Storage & containment"]
["Otji Dry Toilet Solutions","Dry","Sit","Yes","Ceramic","For purchase","Storage & containment"]
["Pedestal Seats (category)","Either","Sit","No","Plastic","For purchase","Storage & containment"]
["Piet Urine Diversion Toilet","Wet","Sit","Yes","Ceramic","For purchase","Storage & containment"]
["SaTo Hygenic Toilet Pans","Wet","Sit/Squat","No","Plastic","For purchase","Storage & containment"]
["Separett Privy Kit","Dry","Sit","Yes","Plastic","For purchase","Storage & containment"]
["Squat Pans (category)","Either","Squat","No","Various","For purchase","Storage & containment"]
["Urine Diverting Toilets","Either","Sit/Squat","Yes","Plastic","For purchase","Storage & containment"]
[]
["STORAGE & CONTAINMENT"]
["Technology","Number of users","Containment ","Suitable for high water table or flood prone area","Minimum available space","Removal method(s)","Treatment","Outputs for reuse","Method of use","Urine diverting","Type of system","Availability","Proceed to"]
["Airhead Composting Toilet","Household","Above ground","Yes","0-9m²","Container","Offsite","Compost","Container","Yes","Dry","For purchase","Conveyance"]
["Aqua Privys (Septic Tank)","Either","Below ground","No","9-49m²","Manual/Pump","Offsite","None","Sit/Squat","No","Wet","For purchase","Conveyance"]
["Aquatron Toilet","Household","Container","No","0-9m²","Container","Offsite","Compost","Container","Yes","Wet","For purchase","Conveyance"]
["Arborloo","Household","Below ground","No","0-9m²","NA","Onsite","None","Sit/Squat","Yes","Dry","Open source","Use and/or disposal"]
["Banos Mejorados Secos Design","Household","Above ground","Yes","0-9m²","Manual/Pump","Offsite","Compost","Sit","Yes","Dry","For purchase","Conveyance "]
["Biofil Digester","Household","Above ground","Yes","9-49m²","NA","Onsite","Compost","Sit/Squat","No","Wet","For purchase","Use and/or disposal"]
["BioSanGas Toilet and Biogas System","Community","Above ground","Yes","9-49m²","NA","Onsite","Biogas","Sit","No","Wet","For purchase","Use and/or disposal"]
["Blue Diversion Toilet ","Either","Container","Yes","0-9m²","Container","Offsite","Compost","Container","Yes","Dry","In development","Conveyance"]
["Bristol Emergency Chemical Toilet","Household","Container","Yes","0-9m²","Container","Offsite","None","Container","No","Dry","For purchase","Conveyance"]
["CalTech Toilet ","Household","Container","Yes","0-9m²","NA","Onsite","Briquettes","Sit","No","Wet","In development","Use and/or disposal"]
["Clean Team Toilet","Household","Container","Yes","0-9m²","Container","Offsite","None","Container","Yes","Dry","For purchase","Conveyance"]
["Crainfield Nano Membrane Toilet","Household","Above ground","Yes","0-9m²","NA","Onsite","None","Sit","Yes","Dry","In development","Use and/or disposal"]
["Duraplast Septic Tank","Household","Below ground","Yes","0-9m²","Manual/Pump","Offsite","None","Sit/Squat","No","Wet","For purchase","Conveyance"]
["Earth Auger","Household","Above ground","Yes","0-9m²","NA","Onsite","Compost","Sit","Yes","Dry","In development","Use and/or disposal"]
["Easy Latrine","Household","Below ground","No","9-49m²","NA","Onsite","Compost","Squat","No","Wet","For purchase","Use and/or disposal"]
["Ecodomeo","Household","Above ground","Yes","9-49m²","NA","Onsite","Compost","Sit/Squat","No","Dry","For purchase","Use and/or disposal"]
["Ecological Urinal ","Household","Container","Yes","0-9m²","Container","NA","None","Container","Yes","Dry","For purchase","Conveyance"]
["Ecosan Pit Toilets - VIP 450, VIP 200","Household","Container","No","0-9m²","Manual/Pump","Offsite","Compost","Sit","No","Dry","For purchase","Conveyance "]
["Ecosan Waterless Toilet","Household","Above ground","Yes","9-49m²","NA","Onsite","Compost","Sit","No","Dry","For purchase","Use and/or disposal"]
["EkoLakay Toilet","Household","Container","Yes","0-9m²","Container","Offsite","Compost","Container","Yes","Dry","For purchase","Conveyance"]
["Enbiolet Toilet - Community","Community","Above ground","Yes",">49m²","NA","Onsite","None","Sit/Squat","Yes","Wet","For purchase","Use and/or disposal"]
["Enbiolet Toilet - Single","Household","Above ground","Yes","0-9m²","NA","Onsite","None","Sit/Squat","Yes","Wet","For purchase","Use and/or disposal"]
["Enviro-Loo - Communal","Community","Below ground","Yes","0-9m²","NA","Onsite","Compost","Sit","Yes","Dry","For purchase","Use and/or disposal"]
["Enviro-Loo - Domestic","Household","Below ground","Yes","0-9m²","NA","Onsite","Compost","Sit","Yes","Dry","For purchase","Use and/or disposal"]
["Enviro-Loo - Industrial","Community","Below ground","Yes","9-49m²","NA","Onsite","Compost","Sit","Yes","Dry","For purchase","Use and/or disposal"]
["Enviro-Loo - Urinal ","Community","Below ground","Yes","0-9m²","NA","NA","None","Sit","Yes","Dry","For purchase","Conveyance"]
["Envirosan - Double Chamber Urine Diversion","Household","Below ground","Yes","9-49m²","Manual","Offsite","Compost","Sit","Yes","Dry","For purchase","Conveyance "]
["Envirosan - Urine Diversion with Removable Bin","Household","Above ground","Yes","0-9m²","NA","Onsite","Compost","Sit","Yes","Dry","For purchase","Use and/or disposal"]
["Envirosan - VIP with Toilet","Household","Below ground","No","0-9m²","Manual/Pump","Offsite","Compost","Sit","Yes","Dry","For purchase","Conveyance"]
["Envirosan - VIP with Urine Diversion","Household","Below ground","Yes","0-9m²","Manual/Pump","Offsite","Compost","Sit","Yes","Dry","For purchase","Conveyance "]
["Eram Delight","Community","Above ground","Yes",">49m²","NA","Onsite","None","Sit","Yes","Wet","For purchase","Use and/or disposal"]
["Flexi Biogas Systems Model BG5","Household","Above ground","Yes","9-49m²","Manual/Pump","Onsite","Biogas","Sit/Squat","No","Wet","For purchase","Use and/or disposal"]
["Flexi Biogas Systems Model BG6","Household","Above ground","Yes","9-49m²","Manual/Pump","Onsite","Biogas","Sit/Squat","No","Wet","For purchase","Use and/or disposal"]
["Flexi Biogas Systems Model DBG","Community","Above ground","Yes","9-49m²","Manual/Pump","Offsite","Biogas","Sit/Squat","No","Wet","For purchase","Use and/or disposal"]
["Flexigester SIB Kit","Community","Below ground","Yes",">49m²","Manual/Pump","Offsite","Biogas","Sit/Squat","No","Wet","For purchase","Conveyance"]
["Flexigester V10 Kit","Community","Below ground","Yes",">49m²","Manual/Pump","Offsite","Biogas","Sit/Squat","No","Wet","For purchase","Use and/or disposal"]
["Fossa Alterna (double pit latrine)","Household","Below ground","No","9-49m²","NA","Onsite","Compost","Sit/Squat","No","Dry","Open source","Use and/or disposal"]
["GesiShamba","Household","Above ground","Yes","9-49m²","NA","Onsite","Biogas","Sit/Squat","No","Wet","For purchase","Use and/or disposal"]
["Ghana Sustainable Aid Project Microflush Toilets","Household","Below ground","No","9-49m²","NA","Onsite","Compost","Sit/Squat","Yes","Dry","For purchase","Use and/or disposal"]
["Green, Portable Toilet","Community","Container","Yes","9-49m²","Container","Offsite","Compost","Container","No","Dry","In development","Conveyance"]
["Loolaboo","Household","Container","Yes","9-49m²","Container","Offsite","Compost","Container","No","Wet","For purchase","Conveyance"]
["Loowatt","Either","Container","Yes","0-9m²","Container","Offsite","Biogas","Container","No","Dry","For purchase","Conveyance"]
["Loughborough Universities Toilet","Household","Container","Yes","0-9m²","NA","Onsite","Briquettes","Sit","No","Dry","In development","Use and/or disposal"]
["Lovable Loo","Household","Container","Yes","0-9m²","Container","Offsite","Compost","Container","No","Dry","For purchase","Conveyance"]
["Microbial Fuel Cell Latrine","Household","Below ground","No","0-9m²","NA","Onsite","Compost","Sit","No","Dry","In development","Use and/or disposal"]
["MoSan Toilet","Household","Container","Yes","0-9m²","Container","Offsite","Compost","Container","Yes","Dry","For purchase","Conveyance"]
["Otji Toilet","Household","Below ground","No","0-9m²","Manual","Offsite","Compost","Sit","Yes","Dry","For purchase","Conveyance "]
["Oxford Emergency Chemical Toilet","Household","Container","Yes","0-9m²","Container","Offsite","None","Container","No","Dry","For purchase","Conveyance "]
["Peepoo Bag","Either","Container","No","0-9m²","Container","Onsite","None","Container","No","Dry","For purchase","Use and/or disposal"]
["Perfect Privy","Household","Container","Yes","0-9m²","Container","Offsite","Compost","Container","Yes","Dry","For purchase","Conveyance "]
["RTI Toilet","Household","Above ground","Yes","9-49m²","NA","Onsite","None","Sit","Yes","Dry","In development","Use and/or disposal"]
["Sanergy Model - Fresh Life Toilet","Either","Container","Yes","0-9m²","Container","Offsite","Compost","Container","Yes","Dry","For purchase","Conveyance"]
["Sanivation Solutions Bucket Toilet","Household","Container","Yes","0-9m²","Container","Offsite","Briquettes","Container","Yes","Dry","For purchase","Conveyance"]
["Separett Toilets","Household","Container","Yes","0-9m²","Container","Offsite","Compost","Container","Yes","Dry","For purchase","Conveyance"]
["Septic Tank","Either","Above ground","Yes","0-9m²","Manual/Pump","Offsite","None","Sit/Squat","No","Wet","For purchase","Conveyance"]
["SimSan BucketMate Toilet","Household","Container","Yes","0-9m²","Container","Offsite","Compost","Container","Yes","Dry","For purchase","Conveyance"]
["Single Pit Latrine","Household","Below ground","No","0-9m²","Manual/Pump","Offsite","None","Sit/Squat","No","Dry","Open source","Conveyance "]
["Sistema Biobolsa - Wastewater Treatment","Household","Above ground","Yes","0-9m²","NA","Onsite","Biogas","Sit/Squat","Yes","Wet","For purchase","Use and/or disposal"]
["Sulabh Household Toilet","Household","Below ground","No","9-49m²","NA","Onsite","Compost","Sit/Squat","Yes","Wet","For purchase","Use and/or disposal"]
["Sun-Mar Toilet and Two-Pit System","Household","Container","Yes","0-9m²","NA","Onsite","Compost","Sit/Squat","Yes","Dry","For purchase","Use and/or disposal"]
["TfP Space-Saver Composting Toilet (Crapper)","Household","Above ground","Yes","0-9m²","Container","Offsite","Compost","Container","Yes","Dry","For purchase","Conveyance "]
["Tiger Worm Toilet","Household","Above ground","Yes","0-9m²","NA","Onsite","Compost","Sit","No","Wet","For purchase","Use and/or disposal"]
["University of Toronto Smoldering Toilet","Household","Above ground","Yes","0-9m²","NA","Onsite","None","Sit","Yes","Dry","In development","Use and/or disposal"]
["Ventilated Improved Pit Latrine","Household","Below ground","No","0-9m²","Manual/Pump","Offsite","None","Sit/Squat","No","Dry","Open source","Conveyance"]
["Visa Portable Chemical Toilet","Household","Container","Yes","0-9m²","Container","Offsite","Compost","Container","No","Wet","For purchase","Conveyance "]
["WooWoo Waterless Toilets (KL1, KL2, KL3, STK)","Community","Above ground","Yes","0-9m²","NA","Onsite","Compost","Sit","Yes","Dry","For purchase","Use and/or disposal"]
["X-Runner","Household","Container","Yes","0-9m²","Container","Offsite","Compost","Container","Yes","Dry","For purchase","Conveyance "]
[]
[]
["CONVEYANCE"]
["Technology","Removal method","Availability","Proceed to"]
["Container Based System","Container","For purchase","Treatment"]
["Diaphragm Pump","Pump (both)","For purchase","Treatment"]
["eVac (electric vacuum)","Pump (motorized)","For purchase","Treatment"]
["Excrevator ","Pump (motorized)","In development","Treatment"]
["Gulper / Extendable Gulper","Pump (manual)","For purchase","Treatment"]
["Hand tools and personal protective equipment ","Manual","For purchase","Treatment"]
["Manual Pump (Omni-Ingestor)","Pump (manual)","In development","Treatment"]
["Pit Screw Auger","Pump (motorized)","For purchase","Treatment"]
["Poo Pump","Pump (manual)","For purchase","Treatment"]
["Sewer system (simplified, solids-free, conventional)","Pipe","Open source ","Treatment"]
["Sludge Digger","Manual","In development","Treatment"]
["Vacuum truck","Pump (motorized)","For purchase","Treatment"]
[]
[]
[]
["TREATMENT"]
["Technology","Treatment","Inputs","Outputs for disposal or further treatment"]
["Activated sludge","Offsite","Effluent, Blackwater, Brownwater, Greywater","Effluent, Sludge"]
["Aerated Pond","Offsite","Effluent, Blackwater, Brownwater, Greywater","Effluent, Sludge"]
["Anaerobic Baffled Reactor","Offsite","Blackwater, Greywater","Effluent, Sludge"]
["Anaerobic Filter","Offsite","Blackwater, Greywater","Effluent, Sludge"]
["Anaerobic Membrance Bioreactor (AnMBR)","Offsite","Blackwater, Greywater, Food waste","Sludge"]
["Biogas Reactor","Offsite","Sludge, Organics, Blackwater","Sludge"]
["Bolah Bondeh Project: Organic Compost","Offsite","Sludge","None"]
["Co-composting","Offsite","Sludge, Organics","None"]
["Community Vermiculture ","Offsite","Sludge","None"]
["Constructed Wetland: Free-Water Surface","Offsite","Effluent, Stormwater ","Effluent, Biomass"]
["Constructed Wetland: Horizontal Subsurface Flow ","Offsite","Effluent, Blackwater, Brownwater, Greywater","Effluent, Biomass"]
["Constructed Wetland: Vertical Flow ","Offsite","Effluent, Blackwater, Brownwater, Greywater","Effluent, Biomass"]
["Drying Beds: Planted ","Offsite","Sludge","Sludge, Effluent"]
["Drying Beds: Unplanted","Offsite","Sludge","Sludge, Effluent"]
["Flexi Biogas Systems Model BG6","Offsite","Sludge, Organics, Blackwater","Sludge"]
["Howard-Higgins EcoSan and Waste Management System","Offsite","Sludge, Organics","None"]
["Imhoff Tank","Offsite","Blackwater, Greywater","Effluent, Sludge"]
["LaDePa (Latrine Dehydration and Pasturization)","Offsite","Sludge","Disinfected dried solids"]
["Sanivation Solar Charcoal Oven","Offsite","Solid waste, Biochar","None"]
["Sedimentation / Thickening Ponds ","Offsite","Sludge","Sludge, Effluent"]
["Settler","Offsite","Blackwater, Brownwater, Greywater","Effluent, Sludge"]
["Solar Sludge Oven ","Offsite","Sludge","Disinfected dried solids"]
["Trickling Filter","Offsite","Sludge","Effluent, Sludge"]
["Upflow Anaerobic Sludge Blanket Reactor ","Offsite","Blackwater, Greywater","Effluent, Sludge"]
["Waste Stabilization Ponds","Offsite","Blackwater, Greywater","Effluent, Sludge"]
[]
[]
["USE & DISPOSAL"]
["End products ","Reuse or disposal","Outputs for reuse"]
["Biogas","Reuse","Biogas"]
["Biomass","Reuse","Biomass"]
["Briquettes","Reuse","Briquettes"]
["Compost","Reuse","Compost"]
["Disinfected dried solids ","Disposal","None"]
["Effluent (treated, disinfected)","Disposal","None"]
["Sludge","Disposal","None"]